{"text_format":"1","workbook":"xlsx","n_sheets":3,"sheets":["Wycena","SKU","Mapping"],"not_rendered":{"charts":0,"images":1,"macros":1,"external_links":1,"defined_names":75,"comments":0,"pivot_tables":0},"unopened":[],"bounds":{"document_bytes":16777216,"sheet_cells":100000,"rows_first":2000,"rows_last":500,"rows_between":2000,"halvings":0,"cell_chars":16384,"cell_head_chars":4096},"cells_cut":0,"cells_raw":0,"read":"whole","date_system":"1900"}

{"sheet":"Wycena","index":0,"n_rows":86,"n_cols":7,"rows_kept":86,"cut":false,"hidden":false,"merged":[[86,1,87,5]]}
[]
[]
[null,"POZYCJA","ZAMÓWIENIE",null,"SZCZEGÓŁY","CENA NETTO"]
[null,"Podstawy",null,null,null,null,{"$f":"TODAY()","v":"2024-02-05"}]
[null,"Model drzwi","-",null,"Tu wpisz uwagi",{"$f":"IFERROR(VLOOKUP(C5,SKU!$B$1:$C$1030,2,0),0)","v":0}]
[null,"Szklenie","-",null,"Tu wpisz uwagi",{"$f":"IFERROR(VLOOKUP(C6,Mapping!$M$3:$O$10,2,0),0)","v":0}]
[null,"Wykończenie","Dab prosty podluzny",null,null,{"$f":"IFERROR(VLOOKUP(C7,Mapping!$Q$3:$R$8,2,0),0)","v":0}]
[null,"Ilość kolorów","Jeden (standard)",null,null,{"$f":"IFERROR(VLOOKUP(C8,Mapping!$V$3:$W$6,2,0),0)","v":0}]
[null,"Kolor","-",null,"-",{"$f":"MAX(IFERROR(VLOOKUP(E9,Mapping!$Y$3:$Z$229,2,0),0),IFERROR((VLOOKUP(C9,Mapping!$Y$3:$Z$229,2,0)),0))","v":0}]
[null,"Inox dustronny","-",null,null,{"$f":"IFERROR(VLOOKUP(C10,Mapping!$AE$3:$AF$4,2,0),0)","v":0}]
[null,"Rodzaj kamienia","-",null,null,{"$f":"IFERROR(VLOOKUP(C11,Mapping!$AI$3:$AJ$7,2,0)*IFERROR((VLOOKUP(C42,Mapping!$ET$3:$EU$8,2,1)+1),1),0)","v":0}]
[]
[null,"Konstrukcja drzwi"]
[null,"Przylgowość","Przylgowe",null,null,{"$f":"IFERROR(VLOOKUP($C$14,Mapping!$AN$3:$AO$5,2,0),0)","v":0}]
[null,"Kolor zawiasów","Inox",null,null,{"$f":"IFERROR(VLOOKUP(C15,Mapping!$JD$3:$JE$4,2,0),0)","v":0}]
[null,"Grubość drzwi [mm]","-"]
[null,"Szerokość drzwi [cm]",102,null,{"$f":"\"Standard do: \"&IF(C16=\"-\",102,IF(C16=78, 102,106))","v":"Standard do: 102"}]
[null,"Wysokość drzwi [cm]",210,null,{"$f":"\"Standard do: \"&IF(C16=\"-\",212,IF(C16=78, 212,214))","v":"Standard do: 212"}]
[null,"Kierunek otwierania","-"]
[null,"Dostawka od strony zawias","-",null,{"$f":"IF((VLOOKUP(VLOOKUP(C17,Mapping!$AX$2:$BA$230,4,0),Mapping!$BB$3:$BC$5,2,0))=\"Konieczna dostawka\",IF(OR(C20<>\"-\",C21<>\"-\"),\"\",\"Konieczna dostawka\"),IF((VLOOKUP(VLOOKUP(C17,Mapping!$AX$2:$BA$230,4,0),Mapping!$BB$3:$BC$5,2,0))=\"Konieczne 2 dostawki\",IF(AND(C20<>\"-\",C21<>\"-\"),\"\",\"Konieczne 2 dostawki\"),\"\"))","v":""}]
[null,"Dostawka od strony zamka","-",null,{"$f":"IF((VLOOKUP(VLOOKUP(C17,Mapping!$AX$2:$BA$230,4,0),Mapping!$BB$3:$BC$5,2,0))=\"Konieczna dostawka\",IF(OR(C20<>\"-\",C21<>\"-\"),\"\",\"Konieczna dostawka\"),IF((VLOOKUP(VLOOKUP(C17,Mapping!$AX$2:$BA$230,4,0),Mapping!$BB$3:$BC$5,2,0))=\"Konieczne 2 dostawki\",IF(AND(C20<>\"-\",C21<>\"-\"),\"\",\"Konieczne 2 dostawki\"),\"\"))","v":""}]
[null,"Naświetle górne","-",null,{"$f":"IF((VLOOKUP(VLOOKUP(C18,Mapping!$BD$2:$BG$172,4,0),Mapping!$BH$3:$BI$4,2,0))=\"Konieczne naświetle\",IF(C22=\"-\",\"Konieczne naświetle\",\"\"),\"\")","v":""}]
[]
[null,"Ościeżnica"]
[null,"Rodzaj","Standardowa",null,null,{"$f":"IFERROR(VLOOKUP(C25,Mapping!$CJ$3:$CK$4,2,0),0)","v":0}]
[null,"Aplikacja retro","-",null,null,{"$f":"IFERROR(VLOOKUP(C26,Mapping!$CO$3:$CP$11,2,0),0)","v":0}]
[null,"Grubość górna [cm]",{"$f":"VLOOKUP($C$14,Mapping!$CY$3:$CZ$5,2,0)","v":6},null,{"$f":"\"Standard: \"&VLOOKUP($C$14,Mapping!$CY$3:$CZ$5,2,0)","v":"Standard: 6"},{"$f":"((C27-VLOOKUP($C$14,Mapping!$CY$8:$CZ$10,2,0))*(C17)/100*(VLOOKUP($C$14,Mapping!$CY$12:$CZ$15,2,0)))","v":0}]
[null,"Grubość strona zawias [cm]",{"$f":"VLOOKUP($C$14,Mapping!$DG$3:$DI$5,2,0)","v":6},null,{"$f":"\"Standard: \"&VLOOKUP($C$14,Mapping!$DG$3:$DH$5,2,0)","v":"Standard: 6"},{"$f":"((C28-VLOOKUP($C$14,Mapping!$DG$8:$DH$10,2,0))*(C18)/100*(VLOOKUP($C$14,Mapping!$DG$13:$DH$15,2,0)))","v":0}]
[null,"Grubość strona zamka [cm]",{"$f":"VLOOKUP($C$14,Mapping!$DG$3:$DI$5,3,0)","v":6},null,{"$f":"\"Standard: \"&VLOOKUP($C$14,Mapping!$DG$3:$DI$5,3,0)","v":"Standard: 6"},{"$f":"((C29-VLOOKUP($C$14,Mapping!$DG$8:$DI$10,3,0))*(C18)/100*(VLOOKUP($C$14,Mapping!$DG$13:$DI$15,3,0)))","v":0}]
[null,"Szerokość [cm]",{"$f":"VLOOKUP($C$25,Mapping!$DQ$3:$DR$4,2,0)","v":10.5},null,{"$f":"\"Standard: \"&VLOOKUP($C$25,Mapping!$DQ$3:$DR$4,2,0)","v":"Standard: 10,5"},{"$f":"(C30-VLOOKUP($C$25,Mapping!$DQ$3:$DR$4,2,0))*(C17+2*C18)/100*VLOOKUP($C$25,Mapping!$DQ$13:$DR$14,2,0)","v":0}]
[null,"Zabudowa wewnętrzna [cm]","-",null,null,{"$f":"IFERROR(C31*($C$17+$C$18*2)/100*7,0)","v":0}]
[null,"Zabudowa zewnętrzna [cm]","-",null,null,{"$f":"IFERROR(C32*($C$17+$C$18*2)/100*7,0)","v":0}]
[]
[null,"Opaski"]
[null,"Regulowana wewnętrzna","-",null,"Szerokosć 8 cm",{"$f":"IFERROR(VLOOKUP($C$35,Mapping!$DY$3:$DZ$4,2,0),0)","v":0}]
[null,"Regulowana zewnętrzna","-",null,"Szerokosć 10 cm",{"$f":"IFERROR(VLOOKUP($C$36,Mapping!$EB$3:$EC$4,2,0),0)","v":0}]
[null,"Maskująca stała","-",null,null,{"$f":"IFERROR(VLOOKUP($C$37,Mapping!$EG$3:$EH$5,2,0),0)","v":0}]
[null,"Ćwierćwałek","-",null,null,{"$f":"IFERROR(VLOOKUP($C$38,Mapping!$EJ$3:$EK$5,2,0),0)","v":0}]
[]
[null,"Skrzydło"]
[null,"Światło przejścia szerokość [cm]","-",null,"Wybierz opcję lub wpisz",{"$f":"IFERROR(VLOOKUP(C41,Mapping!$EN$3:$EO$8,2,1),0)","v":0}]
[null,"Światło przejścia wysokość [cm]","-",null,"Wybierz opcję lub wpisz",{"$f":"(IFERROR(VLOOKUP(C42,Mapping!$ET$3:$EU$8,2,1),0))*SUM($F$5:$F$10,F41)","v":0}]
[]
[null,"Dostawki boczne"]
[null,"Od zawias - szerokość w świetle [cm]",{"$f":"IFERROR(IF(C20<>\"-\",((C17-C28-C29)-C41)/IF(AND(C20<>\"-\",C21<>\"-\")=TRUE,2,1)+VLOOKUP(Wycena!C26,Mapping!$CO$40:$CS$49,IF(AND(Wycena!C20=\"-\",Wycena!C21=\"-\"),2,IF(AND(Wycena!C20<>\"-\",Wycena!C21=\"-\"),3,IF(AND(Wycena!C20=\"-\",Wycena!C21<>\"-\"),4,5))),0),\"-\"),\"-\")","v":"-"},null,"Automatycznie",{"$f":"IFERROR(IF(E46=\"\",(VLOOKUP(C45,Mapping!$EZ$3:$FB$6,2,1)*SUM(F5:F10)*(VLOOKUP(C42,Mapping!$ET$3:$EU$8,2,1)+1)),\"Błąd wyceny\"),0)","v":0}]
[null,"Od zawias - rodzaj szklenia","-",null,{"$f":"IF(C45<IFERROR(VLOOKUP($C$5,Mapping!$A$2:$I$168,((VLOOKUP(C20,Mapping!$J$2:$K$7,2,0)+IF((OR(C46=\"-\",C46=\"Brak (pełne)\")),0,1))),0),0),\"Dostawka za wąska\",IF(C45=\"-\",\"\",IF(C45>100,\"Wycena indywidualna\",\"\")))","v":""},{"$f":"IFERROR(IF(E46=\"\",IF(AND(C45>69.99,C46=\"Witraż\"),\"Wycena indywidulana\",(IF((VLOOKUP(C46,Mapping!$FE$3:$FF$14,2,0)-VLOOKUP(C6,Mapping!$FE$3:$FF$14,2,0))<0,0,(VLOOKUP(C46,Mapping!$FE$3:$FF$14,2,0)-VLOOKUP(C6,Mapping!$FE$3:$FF$14,2,0)))*(VLOOKUP(C42,Mapping!$ET$3:$EU$8,2,1)+1))),\"Błąd wyceny\"),0)","v":0}]
[null,"Od zawias - ilość pól szkła","-",null,"Standard do: 4",{"$f":"IFERROR(IF(E46=\"\",(IF(Mapping!$FN$3-Wycena!$C$47<0,(Wycena!$C$47-Mapping!$FN$3)*Mapping!FN6,0)),\"Błąd wyceny\"),0)","v":0}]
[]
[null,"Od zamka - szerokość w świetle [cm]",{"$f":"IFERROR(IF(C21<>\"-\",((C17-C28-C29)-C41)/IF(AND(C20<>\"-\",C21<>\"-\")=TRUE,2,1)+VLOOKUP(Wycena!C26,Mapping!$CO$52:$CS$61,IF(AND(Wycena!C20=\"-\",Wycena!C21=\"-\"),2,IF(AND(Wycena!C20<>\"-\",Wycena!C21=\"-\"),3,IF(AND(Wycena!C20=\"-\",Wycena!C21<>\"-\"),4,5))),0),\"-\"),\"-\")","v":"-"},null,"Automatycznie",{"$f":"IFERROR(IF(E50=\"\",(VLOOKUP(C49,Mapping!$EZ$3:$FB$6,3,1)*SUM(F5:F10)*(VLOOKUP(C42,Mapping!$ET$3:$EU$8,2,1)+1)),\"Błąd wyceny\"),0)","v":0}]
[null,"Od zamka - rodzaj szklenia","-",null,{"$f":"IF(C49<IFERROR(VLOOKUP($C$5,Mapping!$A$2:$I$168,((VLOOKUP(C21,Mapping!$J$2:$K$7,2,0)+IF((OR(C50=\"-\",C50=\"Brak (pełne)\")),0,1))),0),0),\"Dostawka za wąska\",IF(C49=\"-\",\"\",IF(C49>100,\"Wycena indywidualna\",\"\")))","v":""},{"$f":"IFERROR(IF(E50=\"\",IF(AND(C49>69.99,C50=\"Witraż\"),\"Wycena indywidulana\",(IF((VLOOKUP(C50,Mapping!$FE$3:$FF$14,2,0)-VLOOKUP(C6,Mapping!$FE$3:$FF$14,2,0))<0,0,(VLOOKUP(C50,Mapping!$FE$3:$FF$14,2,0)-VLOOKUP(C6,Mapping!$FE$3:$FF$14,2,0)))*(VLOOKUP(C42,Mapping!$ET$3:$EU$8,2,1)+1))),\"Błąd wyceny\"),0)","v":0}]
[null,"Od zamka- ilość pól szkła","-",null,"Standard do: 4",{"$f":"IFERROR(IF(E50=\"\",(IF(Mapping!$FN$3-Wycena!$C$51<0,(Wycena!$C$51-Mapping!$FN$3)*Mapping!FN6,0)),\"Błąd wyceny\"),0)","v":0}]
[]
[null,"Naświetle"]
[null,"Wysokość [cm]",{"$f":"IFERROR(IF(C22<>\"-\",C18-C27-C42,\"-\"),\"-\")","v":"-"},null,"Automatycznie",{"$f":"IFERROR(IF(E55=\"\",VLOOKUP(C22,Mapping!$BU$3:$BV$6,2,0),\"Błąd wyceny\"),0)","v":0}]
[null,"Szklenie","-",null,{"$f":"IF(C54=\"-\",\"\",IF(C54>100,\"Wycena indywidulana\",IF((IF(C22=\"Imitacja skrzydła\",30,IF(C22<>\"-\",18,\"\")))>C54,\"Za niskie naświetle\",\"\")))","v":""},{"$f":"IFERROR(IF(E55=\"\",VLOOKUP(C55,Mapping!$CA$2:$CC$12,3,0),\"Błąd wyceny\"),0)","v":0}]
[null,"Ilość pól szkła","-",null,"Standard do: 4",{"$f":"IFERROR(IF(E55=\"\",(IF(Mapping!$FN$3-Wycena!$C$56<0,(Wycena!$C$56-Mapping!$FN$3)*Mapping!FN6,0)),\"Błąd wyceny\"),0)","v":0}]
[]
[null,"Okucia"]
[null,"Specjalny zestaw okuć","Brak (standard)",null,null,{"$f":"IFERROR(VLOOKUP(C59,Mapping!$FW$3:$FX$11,2,0),0)","v":0}]
[null,"Zamek","-",null,null,{"$f":"IFERROR(VLOOKUP(C60,Mapping!$FY$15:$FZ$24,2,0),0)","v":0}]
[null,"Okucie zewnętrzne","-",null,null,{"$f":"IFERROR(VLOOKUP(C61,Mapping!$GA$3:$GB$33,2,0),0)","v":0}]
[null,"Kolor okucia","-"]
[null,"Długość antaby [cm]","-"]
[null,"Wkładki","-",null,null,{"$f":"IFERROR(VLOOKUP(C64,Mapping!$GS$3:$GT$8,2,0),\"\")","v":""}]
[null,"Zapadka","-",null,null,{"$f":"IFERROR(VLOOKUP(C65,Mapping!$GW$3:$GX$5,2,0),0)","v":0}]
[null,"Listwa zaczepowa","-",null,null,{"$f":"IFERROR(VLOOKUP(C66,Mapping!$HB$3:$HC$4,2,0),\"\")","v":0}]
[]
[null,"Dodatki"]
[null,"Szyba P4","-",null,null,{"$f":"IFERROR(VLOOKUP(C69,Mapping!$HF$3:$HH$13,3,0),0)","v":0}]
[null,"Próg","Aluminiowy (standard)",null,null,{"$f":"VLOOKUP(C70,Mapping!$HM$3:$HO$5,3,0)","v":0}]
[null,"Adapter podprogowy [cm]","-",null,null,{"$f":"IFERROR(VLOOKUP(C71,Mapping!$HS$3:$HU$20,3,0),0)","v":0}]
[null,"Okapnik","-",null,null,{"$f":"IFERROR(VLOOKUP(C72,Mapping!$HW$3:$HY$9,3,0),0)","v":0}]
[null,"Kopniak inox","-",null,null,{"$f":"IFERROR(VLOOKUP(C73,Mapping!$HW$3:$IA$9,5,0),0)","v":0}]
[null,"Wizjer panoramiczny","-",null,null,{"$f":"IFERROR(VLOOKUP(C74,Mapping!$IE$3:$IF$6,2,0),0)","v":0}]
[null,"Samozamykacz","-",null,null,{"$f":"VLOOKUP(C75,Mapping!$IH$3:$II$13,2,0)","v":0}]
[null,"Kołatka","-",null,null,{"$f":"IFERROR(VLOOKUP(C76,Mapping!$IK$3:$IL$5,2,0),\"\")","v":0}]
[null,"Piaskowanie numery na szkle","-",null,null,{"$f":"IFERROR(VLOOKUP(C77,Mapping!$IN$3:$IO$5,2,0),0)","v":0}]
[null,"Kontaktron (czujka alarmowa)","-",null,null,{"$f":"IFERROR(VLOOKUP(C78,Mapping!$IQ$3:$IR$4,2,0),0)","v":0}]
[null,"Zestaw pielęgnacyjny","-",null,null,{"$f":"VLOOKUP(C79,Mapping!$IT$3:$IU$4,2,0)","v":0}]
[null,"Inne",null,null,"Wpisz pozycję i kwotę"]
[]
[null,"Cena netto",null,null,null,{"$f":"SUM(F5:F81)","v":0}]
[null,"Rabat",null,null,"Wybierz rabat",0]
[null,"Montaż",null,null,"Wybierz kwotę",0]
[null,"Cena brutto (dla wybranej stawki VAT)",0.08,null,"Wybierz stawkę",{"$f":"(F82*(1-F83)+F84)*(1+C85)","v":0}]
[null,"Klient",null,null,"Wpisz nazwisko","xxx"]

{"sheet":"SKU","index":1,"n_rows":743,"n_cols":9,"rows_kept":743,"cut":false,"hidden":true,"merged":[]}
["Kolejność","Model","Cena podstawowa","Konstrukcja","Kolekcja","Szklenie","Drzwi&szklenie","Inox dwustronny","Kamień ozdobny"]
[1,"DB 01",5900,"Płycinowe","Classic Plus","Przezierne",{"$f":"B2&F2","v":"DB 01Przezierne"}]
[1,"DB 01",5900,"Płycinowe","Classic Plus","Brąz refleks",{"$f":"B3&F3","v":"DB 01Brąz refleks"}]
[1,"DB 01",6000,"Płycinowe","Classic Plus","Grafit refleks","DB 01Grafit refleks"]
[1,"DB 01",6000,"Płycinowe","Classic Plus","Lustro weneckie","DB 01Lustro weneckie"]
[1,"DB 01",6200,"Płycinowe","Classic Plus","Mleczne","DB 01Mleczne"]
[1,"DB 01",6200,"Płycinowe","Classic Plus","Piaskowane refleks","DB 01Piaskowane refleks"]
[3,"DB 03",5700,"Płycinowe","Classic Plus","Przezierne","DB 03Przezierne"]
[3,"DB 03",5700,"Płycinowe","Classic Plus","Brąz refleks","DB 03Brąz refleks"]
[3,"DB 03",5800,"Płycinowe","Classic Plus","Grafit refleks","DB 03Grafit refleks"]
[3,"DB 03",5800,"Płycinowe","Classic Plus","Lustro weneckie","DB 03Lustro weneckie"]
[3,"DB 03",6000,"Płycinowe","Classic Plus","Mleczne","DB 03Mleczne"]
[4,"DB 04",5700,"Płycinowe","Classic Plus","Przezierne","DB 04Przezierne"]
[4,"DB 04",5700,"Płycinowe","Classic Plus","Brąz refleks","DB 04Brąz refleks"]
[4,"DB 04",5800,"Płycinowe","Classic Plus","Grafit refleks","DB 04Grafit refleks"]
[4,"DB 04",5800,"Płycinowe","Classic Plus","Lustro weneckie","DB 04Lustro weneckie"]
[4,"DB 04",6000,"Płycinowe","Classic Plus","Mleczne","DB 04Mleczne"]
[7,"DB 07",5700,"Płycinowe","Classic Plus","Przezierne","DB 07Przezierne"]
[7,"DB 07",5700,"Płycinowe","Classic Plus","Brąz refleks","DB 07Brąz refleks"]
[7,"DB 07",5800,"Płycinowe","Classic Plus","Grafit refleks","DB 07Grafit refleks"]
[7,"DB 07",5800,"Płycinowe","Classic Plus","Lustro weneckie","DB 07Lustro weneckie"]
[7,"DB 07",6000,"Płycinowe","Classic Plus","Mleczne","DB 07Mleczne"]
[9,"DB 09a",5700,"Płycinowe","Classic Plus","Przezierne","DB 09aPrzezierne"]
[9,"DB 09a",5700,"Płycinowe","Classic Plus","Brąz refleks","DB 09aBrąz refleks"]
[9,"DB 09a",5800,"Płycinowe","Classic Plus","Grafit refleks","DB 09aGrafit refleks"]
[9,"DB 09a",5800,"Płycinowe","Classic Plus","Lustro weneckie","DB 09aLustro weneckie"]
[9,"DB 09a",6000,"Płycinowe","Classic Plus","Mleczne","DB 09aMleczne"]
[10,"DB 10",5700,"Płycinowe","Classic Plus","Przezierne","DB 10Przezierne"]
[10,"DB 10",5700,"Płycinowe","Classic Plus","Brąz refleks","DB 10Brąz refleks"]
[10,"DB 10",5800,"Płycinowe","Classic Plus","Grafit refleks","DB 10Grafit refleks"]
[10,"DB 10",5800,"Płycinowe","Classic Plus","Lustro weneckie","DB 10Lustro weneckie"]
[10,"DB 10",6000,"Płycinowe","Classic Plus","Mleczne","DB 10Mleczne"]
[11,"DB 11",5700,"Płycinowe","Classic Plus","Przezierne","DB 11Przezierne"]
[11,"DB 11",5700,"Płycinowe","Classic Plus","Brąz refleks","DB 11Brąz refleks"]
[11,"DB 11",5800,"Płycinowe","Classic Plus","Grafit refleks","DB 11Grafit refleks"]
[11,"DB 11",5800,"Płycinowe","Classic Plus","Lustro weneckie","DB 11Lustro weneckie"]
[11,"DB 11",6000,"Płycinowe","Classic Plus","Mleczne","DB 11Mleczne"]
[12,"DB 12",5700,"Płycinowe","Classic Plus","Przezierne","DB 12Przezierne"]
[12,"DB 12",5700,"Płycinowe","Classic Plus","Brąz refleks","DB 12Brąz refleks"]
[12,"DB 12",5800,"Płycinowe","Classic Plus","Grafit refleks","DB 12Grafit refleks"]
[12,"DB 12",5800,"Płycinowe","Classic Plus","Lustro weneckie","DB 12Lustro weneckie"]
[12,"DB 12",6000,"Płycinowe","Classic Plus","Mleczne","DB 12Mleczne"]
[12,"DB 12",6000,"Płycinowe","Classic Plus","Piaskowane refleks","DB 12Piaskowane refleks"]
[14,"DB 14",5700,"Płycinowe","Classic Plus","Przezierne","DB 14Przezierne"]
[14,"DB 14",5700,"Płycinowe","Classic Plus","Brąz refleks","DB 14Brąz refleks"]
[14,"DB 14",5800,"Płycinowe","Classic Plus","Grafit refleks","DB 14Grafit refleks"]
[14,"DB 14",5800,"Płycinowe","Classic Plus","Lustro weneckie","DB 14Lustro weneckie"]
[14,"DB 14",6000,"Płycinowe","Classic Plus","Mleczne","DB 14Mleczne"]
[17,"DB 17",5700,"Płycinowe","Classic Plus","Przezierne","DB 17Przezierne"]
[17,"DB 17",5700,"Płycinowe","Classic Plus","Brąz refleks","DB 17Brąz refleks"]
[17,"DB 17",5800,"Płycinowe","Classic Plus","Grafit refleks","DB 17Grafit refleks"]
[17,"DB 17",5800,"Płycinowe","Classic Plus","Lustro weneckie","DB 17Lustro weneckie"]
[17,"DB 17",6000,"Płycinowe","Classic Plus","Mleczne","DB 17Mleczne"]
[17,"DB 17",6000,"Płycinowe","Classic Plus","Piaskowane refleks","DB 17Piaskowane refleks"]
[17,"DB 17",6000,"Płycinowe","Classic Plus","Brąz refleks wypukły","DB 17Brąz refleks wypukły"]
[18,"DB 18",5700,"Płycinowe","Classic Plus","Przezierne","DB 18Przezierne"]
[18,"DB 18",5700,"Płycinowe","Classic Plus","Brąz refleks","DB 18Brąz refleks"]
[18,"DB 18",5800,"Płycinowe","Classic Plus","Grafit refleks","DB 18Grafit refleks"]
[18,"DB 18",5800,"Płycinowe","Classic Plus","Lustro weneckie","DB 18Lustro weneckie"]
[18,"DB 18",6000,"Płycinowe","Classic Plus","Mleczne","DB 18Mleczne"]
[18,"DB 18",6000,"Płycinowe","Classic Plus","Brąz refleks wypukły","DB 18Brąz refleks wypukły"]
[19,"DB 19a",5700,"Płycinowe","Classic Plus","Przezierne","DB 19aPrzezierne"]
[19,"DB 19a",5700,"Płycinowe","Classic Plus","Brąz refleks","DB 19aBrąz refleks"]
[19,"DB 19a",5800,"Płycinowe","Classic Plus","Grafit refleks","DB 19aGrafit refleks"]
[19,"DB 19a",5800,"Płycinowe","Classic Plus","Lustro weneckie","DB 19aLustro weneckie"]
[19,"DB 19a",6000,"Płycinowe","Classic Plus","Mleczne","DB 19aMleczne"]
[20,"DB 20",5700,"Płycinowe","Classic Plus","Przezierne",{"$f":"B67&F67","v":"DB 20Przezierne"}]
[20,"DB 20",5700,"Płycinowe","Classic Plus","Brąz refleks","DB 20Brąz refleks"]
[20,"DB 20",5800,"Płycinowe","Classic Plus","Grafit refleks","DB 20Grafit refleks"]
[20,"DB 20",5800,"Płycinowe","Classic Plus","Lustro weneckie","DB 20Lustro weneckie"]
[20,"DB 20",6000,"Płycinowe","Classic Plus","Mleczne","DB 20Mleczne"]
[21,"DB 21",5900,"Płycinowe","Classic Plus","Przezierne","DB 21Przezierne"]
[21,"DB 21",5900,"Płycinowe","Classic Plus","Brąz refleks","DB 21Brąz refleks"]
[21,"DB 21",6000,"Płycinowe","Classic Plus","Grafit refleks","DB 21Grafit refleks"]
[21,"DB 21",6000,"Płycinowe","Classic Plus","Lustro weneckie","DB 21Lustro weneckie"]
[21,"DB 21",6200,"Płycinowe","Classic Plus","Mleczne","DB 21Mleczne"]
[21,"DB 21",6200,"Płycinowe","Classic Plus","Piaskowane refleks","DB 21Piaskowane refleks"]
[21,"DB 21",6200,"Płycinowe","Classic Plus","Brąz refleks wypukły","DB 21Brąz refleks wypukły"]
[28,"DB 28",5700,"Płycinowe","Classic Plus","Przezierne","DB 28Przezierne"]
[28,"DB 28",5700,"Płycinowe","Classic Plus","Brąz refleks","DB 28Brąz refleks"]
[28,"DB 28",5800,"Płycinowe","Classic Plus","Grafit refleks","DB 28Grafit refleks"]
[28,"DB 28",5800,"Płycinowe","Classic Plus","Lustro weneckie","DB 28Lustro weneckie"]
[28,"DB 28",6000,"Płycinowe","Classic Plus","Mleczne","DB 28Mleczne"]
[31,"DB 31",5700,"Płycinowe","Classic Plus","Przezierne","DB 31Przezierne"]
[31,"DB 31",5700,"Płycinowe","Classic Plus","Brąz refleks","DB 31Brąz refleks"]
[31,"DB 31",5800,"Płycinowe","Classic Plus","Grafit refleks","DB 31Grafit refleks"]
[31,"DB 31",5800,"Płycinowe","Classic Plus","Lustro weneckie","DB 31Lustro weneckie"]
[31,"DB 31",6000,"Płycinowe","Classic Plus","Mleczne","DB 31Mleczne"]
[31,"DB 31a",5700,"Płycinowe","Classic Plus","Przezierne","DB 31aPrzezierne"]
[31,"DB 31a",5700,"Płycinowe","Classic Plus","Brąz refleks","DB 31aBrąz refleks"]
[31,"DB 31a",5800,"Płycinowe","Classic Plus","Grafit refleks","DB 31aGrafit refleks"]
[31,"DB 31a",5800,"Płycinowe","Classic Plus","Lustro weneckie","DB 31aLustro weneckie"]
[31,"DB 31a",6000,"Płycinowe","Classic Plus","Mleczne","DB 31aMleczne"]
[32,"DB 32",5300,"Płycinowe","Classic Plus","Brak (pełne)","DB 32Brak (pełne)"]
[33,"DB 33",5700,"Płycinowe","Classic Plus","Przezierne","DB 33Przezierne"]
[33,"DB 33",5700,"Płycinowe","Classic Plus","Brąz refleks","DB 33Brąz refleks"]
[33,"DB 33",5800,"Płycinowe","Classic Plus","Grafit refleks","DB 33Grafit refleks"]
[33,"DB 33",5800,"Płycinowe","Classic Plus","Lustro weneckie","DB 33Lustro weneckie"]
[33,"DB 33",6000,"Płycinowe","Classic Plus","Mleczne","DB 33Mleczne"]
[34,"DB 34",5300,"Płycinowe","Classic Plus","Brak (pełne)","DB 34Brak (pełne)"]
[39,"DB 39",5700,"Płycinowe","Classic Plus","Przezierne","DB 39Przezierne"]
[39,"DB 39",5700,"Płycinowe","Classic Plus","Brąz refleks","DB 39Brąz refleks"]
[39,"DB 39",5800,"Płycinowe","Classic Plus","Grafit refleks","DB 39Grafit refleks"]
[39,"DB 39",5800,"Płycinowe","Classic Plus","Lustro weneckie","DB 39Lustro weneckie"]
[39,"DB 39",6000,"Płycinowe","Classic Plus","Mleczne","DB 39Mleczne"]
[39,"DB 39",6000,"Płycinowe","Classic Plus","Piaskowane refleks","DB 39Piaskowane refleks"]
[43,"DB 43",5700,"Płycinowe","Classic Plus","Przezierne","DB 43Przezierne"]
[43,"DB 43",5700,"Płycinowe","Classic Plus","Brąz refleks","DB 43Brąz refleks"]
[43,"DB 43",5800,"Płycinowe","Classic Plus","Grafit refleks","DB 43Grafit refleks"]
[43,"DB 43",5800,"Płycinowe","Classic Plus","Lustro weneckie","DB 43Lustro weneckie"]
[43,"DB 43",6000,"Płycinowe","Classic Plus","Mleczne","DB 43Mleczne"]
[45,"DB 45",5700,"Płycinowe","Classic Plus","Przezierne","DB 45Przezierne"]
[45,"DB 45",5700,"Płycinowe","Classic Plus","Brąz refleks","DB 45Brąz refleks"]
[45,"DB 45",5800,"Płycinowe","Classic Plus","Grafit refleks","DB 45Grafit refleks"]
[45,"DB 45",5800,"Płycinowe","Classic Plus","Lustro weneckie","DB 45Lustro weneckie"]
[45,"DB 45",6000,"Płycinowe","Classic Plus","Mleczne","DB 45Mleczne"]
[45,"DB 45",6000,"Płycinowe","Classic Plus","Piaskowane refleks","DB 45Piaskowane refleks"]
[47,"DB 47",5700,"Płycinowe","Classic Plus","Przezierne","DB 47Przezierne"]
[47,"DB 47",5700,"Płycinowe","Classic Plus","Brąz refleks","DB 47Brąz refleks"]
[47,"DB 47",5800,"Płycinowe","Classic Plus","Grafit refleks","DB 47Grafit refleks"]
[47,"DB 47",5800,"Płycinowe","Classic Plus","Lustro weneckie","DB 47Lustro weneckie"]
[47,"DB 47",6000,"Płycinowe","Classic Plus","Mleczne","DB 47Mleczne"]
[51,"DB 51",5300,"Płycinowe","Classic Plus","Przezierne","DB 51Przezierne"]
[51,"DB 51",5300,"Płycinowe","Classic Plus","Brąz refleks","DB 51Brąz refleks"]
[51,"DB 51",5400,"Płycinowe","Classic Plus","Grafit refleks","DB 51Grafit refleks"]
[51,"DB 51",5400,"Płycinowe","Classic Plus","Lustro weneckie","DB 51Lustro weneckie"]
[51,"DB 51",5600,"Płycinowe","Classic Plus","Mleczne","DB 51Mleczne"]
[52,"DB 52a",5300,"Płycinowe","Classic Plus","Brąz refleks","DB 52aBrąz refleks"]
[52,"DB 52a",5400,"Płycinowe","Classic Plus","Grafit refleks",{"$f":"B129&F129","v":"DB 52aGrafit refleks"}]
[52,"DB 52a",5400,"Płycinowe","Classic Plus","Lustro weneckie","DB 52aLustro weneckie"]
[52,"DB 52a",5600,"Płycinowe","Classic Plus","Mleczne","DB 52aMleczne"]
[55,"DB 55",5700,"Płycinowe","Classic","Przezierne","DB 55Przezierne"]
[55,"DB 55",5700,"Płycinowe","Classic","Brąz refleks","DB 55Brąz refleks"]
[55,"DB 55",5800,"Płycinowe","Classic","Grafit refleks","DB 55Grafit refleks"]
[55,"DB 55",5800,"Płycinowe","Classic","Lustro weneckie","DB 55Lustro weneckie"]
[55,"DB 55",6000,"Płycinowe","Classic","Mleczne","DB 55Mleczne"]
[56,"DB 56",5300,"Płycinowe","Classic","Brak (pełne)","DB 56Brak (pełne)"]
[56,"DB 56a",5300,"Płycinowe","Classic","Brak (pełne)","DB 56aBrak (pełne)"]
[57,"DB 57",5700,"Płycinowe","Classic","Przezierne","DB 57Przezierne"]
[57,"DB 57",5700,"Płycinowe","Classic","Brąz refleks","DB 57Brąz refleks"]
[57,"DB 57",5800,"Płycinowe","Classic","Grafit refleks","DB 57Grafit refleks"]
[57,"DB 57",5800,"Płycinowe","Classic","Lustro weneckie","DB 57Lustro weneckie"]
[57,"DB 57",6000,"Płycinowe","Classic","Mleczne","DB 57Mleczne"]
[57,"DB 57",6000,"Płycinowe","Classic","Piaskowane refleks","DB 57Piaskowane refleks"]
[57,"DB 57",6000,"Płycinowe","Classic","Brąz refleks wypukły","DB 57Brąz refleks wypukły"]
[57,"DB 57",6600,"Płycinowe","Classic","Witraz","DB 57Witraz"]
[59,"DB 59",5700,"Płycinowe","Classic","Przezierne","DB 59Przezierne"]
[59,"DB 59",5700,"Płycinowe","Classic","Brąz refleks","DB 59Brąz refleks"]
[59,"DB 59",5800,"Płycinowe","Classic","Grafit refleks","DB 59Grafit refleks"]
[59,"DB 59",5800,"Płycinowe","Classic","Lustro weneckie","DB 59Lustro weneckie"]
[59,"DB 59",6000,"Płycinowe","Classic","Mleczne","DB 59Mleczne"]
[59,"DB 59a",5700,"Płycinowe","Classic","Przezierne","DB 59aPrzezierne"]
[59,"DB 59a",5700,"Płycinowe","Classic","Brąz refleks","DB 59aBrąz refleks"]
[59,"DB 59a",5800,"Płycinowe","Classic","Grafit refleks","DB 59aGrafit refleks"]
[59,"DB 59a",5800,"Płycinowe","Classic","Lustro weneckie","DB 59aLustro weneckie"]
[59,"DB 59a",6000,"Płycinowe","Classic","Mleczne","DB 59aMleczne"]
[60,"DB 60",5700,"Płycinowe","Classic","Przezierne","DB 60Przezierne"]
[60,"DB 60",5700,"Płycinowe","Classic","Brąz refleks","DB 60Brąz refleks"]
[60,"DB 60",5800,"Płycinowe","Classic","Grafit refleks","DB 60Grafit refleks"]
[60,"DB 60",5800,"Płycinowe","Classic","Lustro weneckie","DB 60Lustro weneckie"]
[60,"DB 60",6000,"Płycinowe","Classic","Mleczne","DB 60Mleczne"]
[61,"DB 61a",5700,"Płycinowe","Classic","Brak (pełne)","DB 61aBrak (pełne)"]
[62,"DB 62a",5300,"Płycinowe","Classic","Brak (pełne)","DB 62aBrak (pełne)"]
[63,"DB 63",5300,"Płycinowe","Classic","Brak (pełne)","DB 63Brak (pełne)"]
[63,"DB 63a",5300,"Płycinowe","Classic","Brak (pełne)","DB 63aBrak (pełne)"]
[65,"DB 65",5700,"Płycinowe","Classic","Przezierne","DB 65Przezierne"]
[65,"DB 65",5700,"Płycinowe","Classic","Brąz refleks","DB 65Brąz refleks"]
[65,"DB 65",5800,"Płycinowe","Classic","Grafit refleks","DB 65Grafit refleks"]
[65,"DB 65",5800,"Płycinowe","Classic","Lustro weneckie","DB 65Lustro weneckie"]
[65,"DB 65",6000,"Płycinowe","Classic","Mleczne","DB 65Mleczne"]
[66,"DB 66a",5700,"Płycinowe","Classic","Brak (pełne)","DB 66aBrak (pełne)"]
[67,"DB 67",5700,"Płycinowe","Classic","Przezierne","DB 67Przezierne"]
[67,"DB 67",5700,"Płycinowe","Classic","Brąz refleks","DB 67Brąz refleks"]
[67,"DB 67",5800,"Płycinowe","Classic","Grafit refleks","DB 67Grafit refleks"]
[67,"DB 67",5800,"Płycinowe","Classic","Lustro weneckie","DB 67Lustro weneckie"]
[67,"DB 67",6000,"Płycinowe","Classic","Mleczne","DB 67Mleczne"]
[68,"DB 68a",5700,"Płycinowe","Classic","Brak (pełne)","DB 68aBrak (pełne)"]
[69,"DB 69",5700,"Płycinowe","Classic","Przezierne","DB 69Przezierne"]
[69,"DB 69",5700,"Płycinowe","Classic","Brąz refleks","DB 69Brąz refleks"]
[69,"DB 69",5800,"Płycinowe","Classic","Grafit refleks","DB 69Grafit refleks"]
[69,"DB 69",5800,"Płycinowe","Classic","Lustro weneckie","DB 69Lustro weneckie"]
[69,"DB 69",6000,"Płycinowe","Classic","Mleczne","DB 69Mleczne"]
[70,"DB 70",5700,"Płycinowe","Classic","Przezierne","DB 70Przezierne"]
[70,"DB 70",5700,"Płycinowe","Classic","Brąz refleks","DB 70Brąz refleks"]
[70,"DB 70",5800,"Płycinowe","Classic","Grafit refleks",{"$f":"B185&F185","v":"DB 70Grafit refleks"}]
[70,"DB 70",5800,"Płycinowe","Classic","Lustro weneckie","DB 70Lustro weneckie"]
[70,"DB 70",6000,"Płycinowe","Classic","Mleczne","DB 70Mleczne"]
[71,"DB 71a",5700,"Płycinowe","Classic","Przezierne","DB 71aPrzezierne"]
[71,"DB 71a",5700,"Płycinowe","Classic","Brąz refleks","DB 71aBrąz refleks"]
[71,"DB 71a",5800,"Płycinowe","Classic","Grafit refleks","DB 71aGrafit refleks"]
[71,"DB 71a",5800,"Płycinowe","Classic","Lustro weneckie","DB 71aLustro weneckie"]
[71,"DB 71a",6000,"Płycinowe","Classic","Mleczne","DB 71aMleczne"]
[71,"DB 71a",6000,"Płycinowe","Classic","Piaskowane refleks","DB 71aPiaskowane refleks"]
[72,"DB 72a",5700,"Płycinowe","Classic","Przezierne","DB 72aPrzezierne"]
[72,"DB 72a",5700,"Płycinowe","Classic","Brąz refleks","DB 72aBrąz refleks"]
[72,"DB 72a",5800,"Płycinowe","Classic","Grafit refleks","DB 72aGrafit refleks"]
[72,"DB 72a",5800,"Płycinowe","Classic","Lustro weneckie","DB 72aLustro weneckie"]
[72,"DB 72a",6000,"Płycinowe","Classic","Mleczne","DB 72aMleczne"]
[73,"DB 73",5300,"Płycinowe","Classic","Brak (pełne)","DB 73Brak (pełne)"]
[74,"DB 74",5800,"Płycinowe","Modern Inox","Przezierne","DB 74Przezierne",200]
[74,"DB 74",5800,"Płycinowe","Modern Inox","Brąz refleks","DB 74Brąz refleks",200]
[74,"DB 74",5900,"Płycinowe","Modern Inox","Grafit refleks","DB 74Grafit refleks",200]
[74,"DB 74",5900,"Płycinowe","Modern Inox","Lustro weneckie","DB 74Lustro weneckie",200]
[74,"DB 74",6100,"Płycinowe","Modern Inox","Mleczne","DB 74Mleczne",200]
[77,"DB 77",5800,"Płycinowe","Modern Inox","Przezierne","DB 77Przezierne",200]
[77,"DB 77",5800,"Płycinowe","Modern Inox","Brąz refleks","DB 77Brąz refleks",200]
[77,"DB 77",5900,"Płycinowe","Modern Inox","Grafit refleks","DB 77Grafit refleks",200]
[77,"DB 77",5900,"Płycinowe","Modern Inox","Lustro weneckie","DB 77Lustro weneckie",200]
[77,"DB 77",6100,"Płycinowe","Modern Inox","Mleczne","DB 77Mleczne",200]
[78,"DB 78",5800,"Płycinowe","Modern Inox","Przezierne","DB 78Przezierne",200]
[78,"DB 78",5800,"Płycinowe","Modern Inox","Brąz refleks","DB 78Brąz refleks",200]
[78,"DB 78",5900,"Płycinowe","Modern Inox","Grafit refleks","DB 78Grafit refleks",200]
[78,"DB 78",5900,"Płycinowe","Modern Inox","Lustro weneckie","DB 78Lustro weneckie",200]
[78,"DB 78",6100,"Płycinowe","Modern Inox","Mleczne","DB 78Mleczne",200]
[78,"DB 78",6100,"Płycinowe","Modern Inox","Piaskowane refleks","DB 78Piaskowane refleks",200]
[79,"DB 79",6000,"Płycinowe","Modern Inox","Przezierne","DB 79Przezierne",300]
[79,"DB 79",6000,"Płycinowe","Modern Inox","Brąz refleks","DB 79Brąz refleks",300]
[79,"DB 79",6100,"Płycinowe","Modern Inox","Grafit refleks","DB 79Grafit refleks",300]
[79,"DB 79",6100,"Płycinowe","Modern Inox","Lustro weneckie","DB 79Lustro weneckie",300]
[79,"DB 79",6300,"Płycinowe","Modern Inox","Mleczne","DB 79Mleczne",300]
[79,"DB 79",6300,"Płycinowe","Modern Inox","Piaskowane refleks","DB 79Piaskowane refleks",300]
[80,"DB 80",6000,"Płycinowe","Modern Inox","Przezierne","DB 80Przezierne",300]
[80,"DB 80",6000,"Płycinowe","Modern Inox","Brąz refleks","DB 80Brąz refleks",300]
[80,"DB 80",6100,"Płycinowe","Modern Inox","Grafit refleks","DB 80Grafit refleks",300]
[80,"DB 80",6100,"Płycinowe","Modern Inox","Lustro weneckie","DB 80Lustro weneckie",300]
[80,"DB 80",6300,"Płycinowe","Modern Inox","Mleczne","DB 80Mleczne",300]
[81,"DB 81",5800,"Płycinowe","Modern Inox","Przezierne","DB 81Przezierne",200]
[81,"DB 81",5800,"Płycinowe","Modern Inox","Brąz refleks","DB 81Brąz refleks",200]
[81,"DB 81",5900,"Płycinowe","Modern Inox","Grafit refleks","DB 81Grafit refleks",200]
[81,"DB 81",5900,"Płycinowe","Modern Inox","Lustro weneckie","DB 81Lustro weneckie",200]
[81,"DB 81",6100,"Płycinowe","Modern Inox","Mleczne","DB 81Mleczne",200]
[81,"DB 81",6100,"Płycinowe","Modern Inox","Piaskowane refleks","DB 81Piaskowane refleks",200]
[83,"DB 83",5500,"Płycinowe","Modern Inox","Brak (pełne)","DB 83Brak (pełne)",200]
[85,"DB 85",6400,"Płycinowe","Retro","Brak (pełne)","DB 85Brak (pełne)"]
[85,"DB 85",6800,"Płycinowe","Retro","Brąz refleks","DB 85Brąz refleks"]
[85,"DB 85",6900,"Płycinowe","Retro","Grafit refleks","DB 85Grafit refleks"]
[85,"DB 85",6900,"Płycinowe","Retro","Lustro weneckie","DB 85Lustro weneckie"]
[85,"DB 85",7100,"Płycinowe","Retro","Mleczne","DB 85Mleczne"]
[85,"DB 85",7100,"Płycinowe","Retro","Piaskowane refleks","DB 85Piaskowane refleks"]
[85,"DB 85",7600,"Płycinowe","Retro","Witraz","DB 85Witraz"]
[87,"DB 87a",6400,"Płycinowe","Retro","Brak (pełne)","DB 87aBrak (pełne)"]
[94,"DB 94",6800,"Płycinowe","Retro","Przezierne","DB 94Przezierne"]
[94,"DB 94",6800,"Płycinowe","Retro","Brąz refleks","DB 94Brąz refleks"]
[94,"DB 94",6900,"Płycinowe","Retro","Grafit refleks","DB 94Grafit refleks"]
[94,"DB 94",6900,"Płycinowe","Retro","Lustro weneckie",{"$f":"B245&F245","v":"DB 94Lustro weneckie"}]
[94,"DB 94",7100,"Płycinowe","Retro","Mleczne","DB 94Mleczne"]
[94,"DB 94",7100,"Płycinowe","Retro","Piaskowane refleks","DB 94Piaskowane refleks"]
[94,"DB 94",7100,"Płycinowe","Retro","Brąz refleks wypukły","DB 94Brąz refleks wypukły"]
[94,"DB 94",7600,"Płycinowe","Retro","Witraz","DB 94Witraz"]
[106,"DB 106",6400,"Płycinowe","Retro","Brak (pełne)","DB 106Brak (pełne)"]
[106,"DB 106",6800,"Płycinowe","Retro","Przezierne",{"$f":"B251&F251","v":"DB 106Przezierne"}]
[106,"DB 106",6800,"Płycinowe","Retro","Brąz refleks","DB 106Brąz refleks"]
[106,"DB 106",6900,"Płycinowe","Retro","Grafit refleks","DB 106Grafit refleks"]
[106,"DB 106",6900,"Płycinowe","Retro","Lustro weneckie","DB 106Lustro weneckie"]
[106,"DB 106",7100,"Płycinowe","Retro","Mleczne","DB 106Mleczne"]
[106,"DB 106",7100,"Płycinowe","Retro","Piaskowane refleks","DB 106Piaskowane refleks"]
[106,"DB 106",7600,"Płycinowe","Retro","Witraz","DB 106Witraz"]
[106,"DB 106a",6400,"Płycinowe","Retro","Brak (pełne)","DB 106aBrak (pełne)"]
[106,"DB 106a",6800,"Płycinowe","Retro","Przezierne",{"$f":"B259&F259","v":"DB 106aPrzezierne"}]
[106,"DB 106a",6800,"Płycinowe","Retro","Brąz refleks","DB 106aBrąz refleks"]
[106,"DB 106a",6900,"Płycinowe","Retro","Grafit refleks","DB 106aGrafit refleks"]
[106,"DB 106a",6900,"Płycinowe","Retro","Lustro weneckie","DB 106aLustro weneckie"]
[106,"DB 106a",7100,"Płycinowe","Retro","Mleczne","DB 106aMleczne"]
[106,"DB 106a",7100,"Płycinowe","Retro","Piaskowane refleks","DB 106aPiaskowane refleks"]
[106,"DB 106a",7600,"Płycinowe","Retro","Witraz","DB 106aWitraz"]
[107,"DB 107",6400,"Płycinowe","Retro","Brak (pełne)","DB 107Brak (pełne)"]
[108,"DB 108",6800,"Płycinowe","Retro","Przezierne","DB 108Przezierne"]
[108,"DB 108",6800,"Płycinowe","Retro","Brąz refleks","DB 108Brąz refleks"]
[108,"DB 108",6900,"Płycinowe","Retro","Grafit refleks","DB 108Grafit refleks"]
[108,"DB 108",6900,"Płycinowe","Retro","Lustro weneckie","DB 108Lustro weneckie"]
[108,"DB 108",7100,"Płycinowe","Retro","Mleczne","DB 108Mleczne"]
[108,"DB 108",7100,"Płycinowe","Retro","Piaskowane refleks","DB 108Piaskowane refleks"]
[108,"DB 108",7100,"Płycinowe","Retro","Brąz refleks wypukły","DB 108Brąz refleks wypukły"]
[108,"DB 108",7600,"Płycinowe","Retro","Witraz","DB 108Witraz"]
[151,"DB 151",6400,"Płycinowe","Retro","Przezierne","DB 151Przezierne"]
[151,"DB 151",6400,"Płycinowe","Retro","Brąz refleks","DB 151Brąz refleks"]
[151,"DB 151",6500,"Płycinowe","Retro","Grafit refleks","DB 151Grafit refleks"]
[151,"DB 151",6500,"Płycinowe","Retro","Lustro weneckie","DB 151Lustro weneckie"]
[151,"DB 151",6500,"Płycinowe","Retro","Mleczne","DB 151Mleczne"]
[152,"DB 152",6400,"Płycinowe","Retro","Przezierne","DB 152Przezierne"]
[152,"DB 152",6400,"Płycinowe","Retro","Brąz refleks","DB 152Brąz refleks"]
[152,"DB 152",6500,"Płycinowe","Retro","Grafit refleks","DB 152Grafit refleks"]
[152,"DB 152",6500,"Płycinowe","Retro","Lustro weneckie","DB 152Lustro weneckie"]
[152,"DB 152",6700,"Płycinowe","Retro","Mleczne","DB 152Mleczne"]
[153,"DB 153a",6400,"Płycinowe","Retro","Przezierne","DB 153aPrzezierne"]
[153,"DB 153a",6400,"Płycinowe","Retro","Brąz refleks","DB 153aBrąz refleks"]
[153,"DB 153a",6500,"Płycinowe","Retro","Grafit refleks","DB 153aGrafit refleks"]
[153,"DB 153a",6500,"Płycinowe","Retro","Lustro weneckie","DB 153aLustro weneckie"]
[153,"DB 153a",6700,"Płycinowe","Retro","Mleczne","DB 153aMleczne"]
[154,"DB 154",6400,"Płycinowe","Retro","Przezierne","DB 154Przezierne"]
[154,"DB 154",6400,"Płycinowe","Retro","Brąz refleks","DB 154Brąz refleks"]
[154,"DB 154",6500,"Płycinowe","Retro","Grafit refleks","DB 154Grafit refleks"]
[154,"DB 154",6500,"Płycinowe","Retro","Lustro weneckie","DB 154Lustro weneckie"]
[154,"DB 154",6700,"Płycinowe","Retro","Mleczne","DB 154Mleczne"]
[157,"DB 157",6400,"Płycinowe","Retro","Przezierne","DB 157Przezierne"]
[157,"DB 157",6400,"Płycinowe","Retro","Brąz refleks","DB 157Brąz refleks"]
[157,"DB 157",6500,"Płycinowe","Retro","Grafit refleks","DB 157Grafit refleks"]
[157,"DB 157",6500,"Płycinowe","Retro","Lustro weneckie","DB 157Lustro weneckie"]
[157,"DB 157",6700,"Płycinowe","Retro","Mleczne","DB 157Mleczne"]
[158,"DB 158",6400,"Płycinowe","Retro","Przezierne","DB 158Przezierne"]
[158,"DB 158",6400,"Płycinowe","Retro","Brąz refleks","DB 158Brąz refleks"]
[158,"DB 158",6500,"Płycinowe","Retro","Grafit refleks","DB 158Grafit refleks"]
[158,"DB 158",6500,"Płycinowe","Retro","Lustro weneckie","DB 158Lustro weneckie"]
[158,"DB 158",6700,"Płycinowe","Retro","Mleczne","DB 158Mleczne"]
[159,"DB 159",6400,"Płycinowe","Retro","Przezierne","DB 159Przezierne"]
[159,"DB 159",6400,"Płycinowe","Retro","Brąz refleks","DB 159Brąz refleks"]
[159,"DB 159",6500,"Płycinowe","Retro","Grafit refleks","DB 159Grafit refleks"]
[159,"DB 159",6500,"Płycinowe","Retro","Lustro weneckie",{"$f":"B308&F308","v":"DB 159Lustro weneckie"}]
[159,"DB 159",6700,"Płycinowe","Retro","Mleczne","DB 159Mleczne"]
[200,"DB 200",5700,"Płytowe","Simple","Przezierne","DB 200Przezierne"]
[200,"DB 200",5700,"Płytowe","Simple","Brąz refleks","DB 200Brąz refleks"]
[200,"DB 200",5800,"Płytowe","Simple","Grafit refleks","DB 200Grafit refleks"]
[200,"DB 200",5800,"Płytowe","Simple","Lustro weneckie","DB 200Lustro weneckie"]
[200,"DB 200",6000,"Płytowe","Simple","Mleczne","DB 200Mleczne"]
[200,"DB 200",6000,"Płytowe","Simple","Piaskowane refleks","DB 200Piaskowane refleks"]
[200,"DB 200a",5300,"Płytowe","Simple","Brak (pełne)","DB 200aBrak (pełne)"]
[202,"DB 202a",5700,"Płytowe","Simple","Przezierne","DB 202aPrzezierne"]
[202,"DB 202a",5700,"Płytowe","Simple","Brąz refleks","DB 202aBrąz refleks"]
[202,"DB 202a",5800,"Płytowe","Simple","Grafit refleks","DB 202aGrafit refleks"]
[202,"DB 202a",5800,"Płytowe","Simple","Lustro weneckie","DB 202aLustro weneckie"]
[202,"DB 202a",6000,"Płytowe","Simple","Mleczne","DB 202aMleczne"]
[202,"DB 202a",6000,"Płytowe","Simple","Piaskowane refleks","DB 202aPiaskowane refleks"]
[202,"DB 202a",6500,"Płytowe","Simple","Witraz","DB 202aWitraz"]
[203,"DB 203a",5700,"Płytowe","Simple","Przezierne","DB 203aPrzezierne"]
[203,"DB 203a",5700,"Płytowe","Simple","Brąz refleks","DB 203aBrąz refleks"]
[203,"DB 203a",5800,"Płytowe","Simple","Grafit refleks","DB 203aGrafit refleks"]
[203,"DB 203a",5800,"Płytowe","Simple","Lustro weneckie","DB 203aLustro weneckie"]
[203,"DB 203a",6000,"Płytowe","Simple","Mleczne","DB 203aMleczne"]
[204,"DB 204",5700,"Płytowe","Simple","Przezierne","DB 204Przezierne"]
[204,"DB 204",5700,"Płytowe","Simple","Brąz refleks","DB 204Brąz refleks"]
[204,"DB 204",5800,"Płytowe","Simple","Grafit refleks","DB 204Grafit refleks"]
[204,"DB 204",5800,"Płytowe","Simple","Lustro weneckie","DB 204Lustro weneckie"]
[204,"DB 204",6000,"Płytowe","Simple","Mleczne","DB 204Mleczne"]
[204,"DB 204",6000,"Płytowe","Simple","Piaskowane refleks","DB 204Piaskowane refleks"]
[204,"DB 204a",5700,"Płytowe","Simple","Przezierne","DB 204aPrzezierne"]
[204,"DB 204a",5700,"Płytowe","Simple","Brąz refleks","DB 204aBrąz refleks"]
[204,"DB 204a",5800,"Płytowe","Simple","Grafit refleks","DB 204aGrafit refleks"]
[204,"DB 204a",5800,"Płytowe","Simple","Lustro weneckie","DB 204aLustro weneckie"]
[204,"DB 204a",6000,"Płytowe","Simple","Mleczne","DB 204aMleczne"]
[204,"DB 204a",6000,"Płytowe","Simple","Piaskowane refleks","DB 204aPiaskowane refleks"]
[204,"DB 204a",6500,"Płytowe","Simple","Witraz","DB 204aWitraz"]
[205,"DB 205a",5700,"Płytowe","Simple","Przezierne","DB 205aPrzezierne"]
[205,"DB 205a",5700,"Płytowe","Simple","Brąz refleks","DB 205aBrąz refleks"]
[205,"DB 205a",5800,"Płytowe","Simple","Grafit refleks","DB 205aGrafit refleks"]
[205,"DB 205a",5800,"Płytowe","Simple","Lustro weneckie","DB 205aLustro weneckie"]
[205,"DB 205a",6000,"Płytowe","Simple","Mleczne","DB 205aMleczne"]
[205,"DB 205a",6000,"Płytowe","Simple","Piaskowane refleks","DB 205aPiaskowane refleks"]
[206,"DB 206a",5300,"Płytowe","Simple","Brak (pełne)","DB 206aBrak (pełne)"]
[207,"DB 207",5700,"Płytowe","Simple","Przezierne","DB 207Przezierne"]
[207,"DB 207",5700,"Płytowe","Simple","Brąz refleks","DB 207Brąz refleks"]
[207,"DB 207",5800,"Płytowe","Simple","Grafit refleks","DB 207Grafit refleks"]
[207,"DB 207",5800,"Płytowe","Simple","Lustro weneckie","DB 207Lustro weneckie"]
[207,"DB 207",6000,"Płytowe","Simple","Mleczne","DB 207Mleczne"]
[207,"DB 207",6000,"Płytowe","Simple","Piaskowane refleks","DB 207Piaskowane refleks"]
[207,"DB 207a",5700,"Płytowe","Simple","Przezierne","DB 207aPrzezierne"]
[207,"DB 207a",5700,"Płytowe","Simple","Brąz refleks","DB 207aBrąz refleks"]
[207,"DB 207a",5800,"Płytowe","Simple","Grafit refleks","DB 207aGrafit refleks"]
[207,"DB 207a",5800,"Płytowe","Simple","Lustro weneckie","DB 207aLustro weneckie"]
[207,"DB 207a",6000,"Płytowe","Simple","Mleczne","DB 207aMleczne"]
[207,"DB 207a",6000,"Płytowe","Simple","Piaskowane refleks","DB 207aPiaskowane refleks"]
[207,"DB 207a",6500,"Płytowe","Simple","Witraz","DB 207aWitraz"]
[208,"DB 208a",6500,"Płytowe","Simple","Przezierne","DB 208aPrzezierne"]
[208,"DB 208a",6500,"Płytowe","Simple","Brąz refleks","DB 208aBrąz refleks"]
[208,"DB 208a",6600,"Płytowe","Simple","Grafit refleks","DB 208aGrafit refleks"]
[208,"DB 208a",6600,"Płytowe","Simple","Lustro weneckie","DB 208aLustro weneckie"]
[208,"DB 208a",6800,"Płytowe","Simple","Mleczne","DB 208aMleczne"]
[208,"DB 208a",6800,"Płytowe","Simple","Piaskowane refleks","DB 208aPiaskowane refleks"]
[209,"DB 209a",6500,"Płytowe","Simple","Przezierne","DB 209aPrzezierne"]
[209,"DB 209a",6500,"Płytowe","Simple","Brąz refleks","DB 209aBrąz refleks"]
[209,"DB 209a",6600,"Płytowe","Simple","Grafit refleks",{"$f":"B370&F370","v":"DB 209aGrafit refleks"}]
[209,"DB 209a",6600,"Płytowe","Simple","Lustro weneckie","DB 209aLustro weneckie"]
[209,"DB 209a",6800,"Płytowe","Simple","Mleczne","DB 209aMleczne"]
[209,"DB 209a",6800,"Płytowe","Simple","Piaskowane refleks","DB 209aPiaskowane refleks"]
[209,"DB 209a",7300,"Płytowe","Simple","Witraz","DB 209aWitraz"]
[210,"DB 210a",5900,"Płytowe","Simple","Przezierne","DB 210aPrzezierne"]
[210,"DB 210a",5900,"Płytowe","Simple","Brąz refleks","DB 210aBrąz refleks"]
[210,"DB 210a",6000,"Płytowe","Simple","Grafit refleks","DB 210aGrafit refleks"]
[210,"DB 210a",6000,"Płytowe","Simple","Lustro weneckie","DB 210aLustro weneckie"]
[210,"DB 210a",6200,"Płytowe","Simple","Mleczne","DB 210aMleczne"]
[210,"DB 210a",6200,"Płytowe","Simple","Piaskowane refleks","DB 210aPiaskowane refleks"]
[211,"DB 211",5700,"Płytowe","Simple","Przezierne","DB 211Przezierne"]
[211,"DB 211",5700,"Płytowe","Simple","Brąz refleks","DB 211Brąz refleks"]
[211,"DB 211",5800,"Płytowe","Simple","Grafit refleks","DB 211Grafit refleks"]
[211,"DB 211",5800,"Płytowe","Simple","Lustro weneckie","DB 211Lustro weneckie"]
[211,"DB 211",6000,"Płytowe","Simple","Mleczne","DB 211Mleczne"]
[211,"DB 211a",6500,"Płytowe","Simple","Przezierne","DB 211aPrzezierne"]
[211,"DB 211a",6500,"Płytowe","Simple","Brąz refleks","DB 211aBrąz refleks"]
[211,"DB 211a",6600,"Płytowe","Simple","Grafit refleks","DB 211aGrafit refleks"]
[211,"DB 211a",6600,"Płytowe","Simple","Lustro weneckie","DB 211aLustro weneckie"]
[211,"DB 211a",6800,"Płytowe","Simple","Mleczne","DB 211aMleczne"]
[211,"DB 211a",6800,"Płytowe","Simple","Piaskowane refleks","DB 211aPiaskowane refleks"]
[211,"DB 211a",7300,"Płytowe","Simple","Witraz","DB 211aWitraz"]
[212,"DB 212a",5700,"Płytowe","Simple","Przezierne","DB 212aPrzezierne"]
[212,"DB 212a",5700,"Płytowe","Simple","Brąz refleks","DB 212aBrąz refleks"]
[212,"DB 212a",5800,"Płytowe","Simple","Grafit refleks","DB 212aGrafit refleks"]
[212,"DB 212a",5800,"Płytowe","Simple","Lustro weneckie","DB 212aLustro weneckie"]
[212,"DB 212a",6000,"Płytowe","Simple","Mleczne","DB 212aMleczne"]
[212,"DB 212a",6000,"Płytowe","Simple","Piaskowane refleks","DB 212aPiaskowane refleks"]
[213,"DB 213a",6500,"Płytowe","Simple","Przezierne","DB 213aPrzezierne"]
[213,"DB 213a",6500,"Płytowe","Simple","Brąz refleks","DB 213aBrąz refleks"]
[213,"DB 213a",6600,"Płytowe","Simple","Grafit refleks","DB 213aGrafit refleks"]
[213,"DB 213a",6600,"Płytowe","Simple","Lustro weneckie","DB 213aLustro weneckie"]
[213,"DB 213a",6800,"Płytowe","Simple","Mleczne","DB 213aMleczne"]
[213,"DB 213a",6800,"Płytowe","Simple","Piaskowane refleks","DB 213aPiaskowane refleks"]
[213,"DB 213a",7300,"Płytowe","Simple","Witraz","DB 213aWitraz"]
[214,"DB 214",5300,"Płytowe","Simple","Brak (pełne)","DB 214Brak (pełne)"]
[215,"DB 215",5300,"Płytowe","Simple","Brak (pełne)","DB 215Brak (pełne)"]
[216,"DB 216",5300,"Płytowe","Simple","Brak (pełne)","DB 216Brak (pełne)"]
[217,"DB 217",5300,"Płytowe","Simple","Brak (pełne)","DB 217Brak (pełne)"]
[218,"DB 218",5300,"Płytowe","Simple","Brak (pełne)","DB 218Brak (pełne)"]
[219,"DB 219",5700,"Płytowe","Simple","Przezierne","DB 219Przezierne"]
[219,"DB 219",5700,"Płytowe","Simple","Brąz refleks","DB 219Brąz refleks"]
[219,"DB 219",5800,"Płytowe","Simple","Grafit refleks","DB 219Grafit refleks"]
[219,"DB 219",5800,"Płytowe","Simple","Lustro weneckie","DB 219Lustro weneckie"]
[219,"DB 219",6000,"Płytowe","Simple","Mleczne","DB 219Mleczne"]
[219,"DB 219",6000,"Płytowe","Simple","Piaskowane refleks","DB 219Piaskowane refleks"]
[221,"DB 221",5300,"Płytowe","Simple","Brak (pełne)","DB 221Brak (pełne)"]
[223,"DB 223",7000,"Płytowe","Simple","Brak (pełne)","DB 223Brak (pełne)"]
[224,"DB 224",5300,"Płytowe","Simple","Brak (pełne)","DB 224Brak (pełne)"]
[225,"DB 225",5300,"Płytowe","Simple","Brak (pełne)","DB 225Brak (pełne)"]
[226,"DB 226",5300,"Płytowe","Simple","Brak (pełne)","DB 226Brak (pełne)"]
[249,"DB 249",5900,"Płytowe","Simple","Przezierne","DB 249Przezierne"]
[249,"DB 249",5900,"Płytowe","Simple","Brąz refleks","DB 249Brąz refleks"]
[249,"DB 249",6000,"Płytowe","Simple","Grafit refleks",{"$f":"B424&F424","v":"DB 249Grafit refleks"}]
[249,"DB 249",6000,"Płytowe","Simple","Lustro weneckie","DB 249Lustro weneckie"]
[249,"DB 249",6200,"Płytowe","Simple","Mleczne","DB 249Mleczne"]
[249,"DB 249",6200,"Płytowe","Simple","Piaskowane refleks","DB 249Piaskowane refleks"]
[249,"DB 249",6200,"Płytowe","Simple","Brąz refleks wypukły","DB 249Brąz refleks wypukły"]
[250,"DB 250",5700,"Płytowe","Simple","Przezierne","DB 250Przezierne"]
[250,"DB 250",5700,"Płytowe","Simple","Brąz refleks","DB 250Brąz refleks"]
[250,"DB 250",5800,"Płytowe","Simple","Grafit refleks","DB 250Grafit refleks"]
[250,"DB 250",5800,"Płytowe","Simple","Lustro weneckie","DB 250Lustro weneckie"]
[250,"DB 250",6000,"Płytowe","Simple","Mleczne","DB 250Mleczne"]
[251,"DB 251",5700,"Płytowe","Simple","Przezierne","DB 251Przezierne"]
[251,"DB 251",5700,"Płytowe","Simple","Brąz refleks","DB 251Brąz refleks"]
[251,"DB 251",5800,"Płytowe","Simple","Grafit refleks","DB 251Grafit refleks"]
[251,"DB 251",5800,"Płytowe","Simple","Lustro weneckie","DB 251Lustro weneckie"]
[251,"DB 251",6000,"Płytowe","Simple","Mleczne","DB 251Mleczne"]
[251,"DB 251",6000,"Płytowe","Simple","Piaskowane refleks","DB 251Piaskowane refleks"]
[252,"DB 252",5700,"Płytowe","Simple","Przezierne","DB 252Przezierne"]
[252,"DB 252",5700,"Płytowe","Simple","Brąz refleks","DB 252Brąz refleks"]
[252,"DB 252",5800,"Płytowe","Simple","Grafit refleks","DB 252Grafit refleks"]
[252,"DB 252",5800,"Płytowe","Simple","Lustro weneckie","DB 252Lustro weneckie"]
[252,"DB 252",6000,"Płytowe","Simple","Mleczne","DB 252Mleczne"]
[252,"DB 252",6000,"Płytowe","Simple","Piaskowane refleks","DB 252Piaskowane refleks"]
[253,"DB 253",5700,"Płytowe","Simple","Przezierne","DB 253Przezierne"]
[253,"DB 253",5700,"Płytowe","Simple","Brąz refleks","DB 253Brąz refleks"]
[253,"DB 253",5800,"Płytowe","Simple","Grafit refleks","DB 253Grafit refleks"]
[253,"DB 253",5800,"Płytowe","Simple","Lustro weneckie","DB 253Lustro weneckie"]
[253,"DB 253",6000,"Płytowe","Simple","Mleczne","DB 253Mleczne"]
[253,"DB 253",6000,"Płytowe","Simple","Piaskowane refleks","DB 253Piaskowane refleks"]
[253,"DB 253a",5700,"Płytowe","Simple","Przezierne","DB 253aPrzezierne"]
[253,"DB 253a",5700,"Płytowe","Simple","Brąz refleks","DB 253aBrąz refleks"]
[253,"DB 253a",5800,"Płytowe","Simple","Grafit refleks","DB 253aGrafit refleks"]
[253,"DB 253a",5800,"Płytowe","Simple","Lustro weneckie","DB 253aLustro weneckie"]
[253,"DB 253a",6000,"Płytowe","Simple","Piaskowane refleks","DB 253aPiaskowane refleks"]
[253,"DB 253a",6000,"Płytowe","Simple","Mleczne","DB 253aMleczne"]
[253,"DB 253b",5700,"Płytowe","Simple","Przezierne","DB 253bPrzezierne"]
[253,"DB 253b",5700,"Płytowe","Simple","Brąz refleks","DB 253bBrąz refleks"]
[253,"DB 253b",5800,"Płytowe","Simple","Grafit refleks","DB 253bGrafit refleks"]
[253,"DB 253b",5800,"Płytowe","Simple","Lustro weneckie","DB 253bLustro weneckie"]
[253,"DB 253b",6000,"Płytowe","Simple","Mleczne","DB 253bMleczne"]
[253,"DB 253b",6000,"Płytowe","Simple","Piaskowane refleks","DB 253bPiaskowane refleks"]
[265,"DB 265",5700,"Płytowe","Simple","Przezierne","DB 265Przezierne"]
[265,"DB 265",5700,"Płytowe","Simple","Brąz refleks","DB 265Brąz refleks"]
[265,"DB 265",5800,"Płytowe","Simple","Grafit refleks","DB 265Grafit refleks"]
[265,"DB 265",5800,"Płytowe","Simple","Lustro weneckie","DB 265Lustro weneckie"]
[265,"DB 265",6000,"Płytowe","Simple","Mleczne","DB 265Mleczne"]
[265,"DB 265",6000,"Płytowe","Simple","Piaskowane refleks","DB 265Piaskowane refleks"]
[266,"DB 266",5900,"Płytowe","Simple","Przezierne","DB 266Przezierne"]
[266,"DB 266",5900,"Płytowe","Simple","Brąz refleks","DB 266Brąz refleks"]
[266,"DB 266",6000,"Płytowe","Simple","Grafit refleks","DB 266Grafit refleks"]
[266,"DB 266",6000,"Płytowe","Simple","Lustro weneckie","DB 266Lustro weneckie"]
[266,"DB 266",6200,"Płytowe","Simple","Mleczne","DB 266Mleczne"]
[266,"DB 266",6200,"Płytowe","Simple","Piaskowane refleks","DB 266Piaskowane refleks"]
[273,"DB 273",5900,"Płytowe","Simple","Przezierne","DB 273Przezierne"]
[273,"DB 273",5900,"Płytowe","Simple","Brąz refleks","DB 273Brąz refleks"]
[273,"DB 273",6000,"Płytowe","Simple","Grafit refleks","DB 273Grafit refleks"]
[273,"DB 273",6000,"Płytowe","Simple","Lustro weneckie","DB 273Lustro weneckie"]
[273,"DB 273",6200,"Płytowe","Simple","Mleczne","DB 273Mleczne"]
[274,"DB 274",5700,"Płytowe","Simple","Przezierne","DB 274Przezierne"]
[274,"DB 274",5700,"Płytowe","Simple","Brąz refleks","DB 274Brąz refleks"]
[274,"DB 274",5800,"Płytowe","Simple","Grafit refleks","DB 274Grafit refleks"]
[274,"DB 274",5800,"Płytowe","Simple","Lustro weneckie","DB 274Lustro weneckie"]
[274,"DB 274",6000,"Płytowe","Simple","Mleczne","DB 274Mleczne"]
[274,"DB 274",6000,"Płytowe","Simple","Piaskowane refleks","DB 274Piaskowane refleks"]
[278,"DB 278",5300,"Płytowe","Simple","Brak (pełne)",{"$f":"B487&F487","v":"DB 278Brak (pełne)"}]
[279,"DB 279",5700,"Płytowe","Simple","Przezierne","DB 279Przezierne"]
[279,"DB 279",5700,"Płytowe","Simple","Brąz refleks","DB 279Brąz refleks"]
[279,"DB 279",5800,"Płytowe","Simple","Grafit refleks","DB 279Grafit refleks"]
[279,"DB 279",5800,"Płytowe","Simple","Lustro weneckie","DB 279Lustro weneckie"]
[279,"DB 279",6000,"Płytowe","Simple","Mleczne","DB 279Mleczne"]
[279,"DB 279a",5700,"Płytowe","Simple","Przezierne","DB 279aPrzezierne"]
[279,"DB 279a",5700,"Płytowe","Simple","Brąz refleks","DB 279aBrąz refleks"]
[279,"DB 279a",5800,"Płytowe","Simple","Grafit refleks","DB 279aGrafit refleks"]
[279,"DB 279a",5800,"Płytowe","Simple","Lustro weneckie","DB 279aLustro weneckie"]
[279,"DB 279a",6000,"Płytowe","Simple","Mleczne","DB 279aMleczne"]
[285,"DB 285",5900,"Płytowe","Simple","Przezierne","DB 285Przezierne"]
[285,"DB 285",5900,"Płytowe","Simple","Brąz refleks","DB 285Brąz refleks"]
[285,"DB 285",6000,"Płytowe","Simple","Grafit refleks","DB 285Grafit refleks"]
[285,"DB 285",6000,"Płytowe","Simple","Lustro weneckie","DB 285Lustro weneckie"]
[285,"DB 285",6200,"Płytowe","Simple","Mleczne","DB 285Mleczne"]
[285,"DB 285",6200,"Płytowe","Simple","Piaskowane refleks","DB 285Piaskowane refleks"]
[286,"DB 286",5900,"Płytowe","Simple","Przezierne","DB 286Przezierne"]
[286,"DB 286",5900,"Płytowe","Simple","Brąz refleks","DB 286Brąz refleks"]
[286,"DB 286",6000,"Płytowe","Simple","Grafit refleks","DB 286Grafit refleks"]
[286,"DB 286",6000,"Płytowe","Simple","Lustro weneckie","DB 286Lustro weneckie"]
[286,"DB 286",6200,"Płytowe","Simple","Mleczne","DB 286Mleczne"]
[286,"DB 286",6200,"Płytowe","Simple","Piaskowane refleks","DB 286Piaskowane refleks"]
[289,"DB 289",5300,"Płytowe","Simple","Brak (pełne)","DB 289Brak (pełne)"]
[290,"DB 290",5700,"Płytowe","Simple","Przezierne","DB 290Przezierne"]
[290,"DB 290",5700,"Płytowe","Simple","Brąz refleks","DB 290Brąz refleks"]
[290,"DB 290",5800,"Płytowe","Simple","Grafit refleks","DB 290Grafit refleks"]
[290,"DB 290",5800,"Płytowe","Simple","Lustro weneckie","DB 290Lustro weneckie"]
[290,"DB 290",6000,"Płytowe","Simple","Mleczne","DB 290Mleczne"]
[291,"DB 291",5700,"Płytowe","Simple","Przezierne","DB 291Przezierne"]
[291,"DB 291",5700,"Płytowe","Simple","Brąz refleks","DB 291Brąz refleks"]
[291,"DB 291",5800,"Płytowe","Simple","Grafit refleks","DB 291Grafit refleks"]
[291,"DB 291",5800,"Płytowe","Simple","Lustro weneckie","DB 291Lustro weneckie"]
[291,"DB 291",6000,"Płytowe","Simple","Mleczne","DB 291Mleczne"]
[291,"DB 291",6000,"Płytowe","Simple","Piaskowane refleks","DB 291Piaskowane refleks"]
[292,"DB 292",5700,"Płytowe","Simple","Przezierne","DB 292Przezierne"]
[292,"DB 292",5700,"Płytowe","Simple","Brąz refleks","DB 292Brąz refleks"]
[292,"DB 292",5800,"Płytowe","Simple","Grafit refleks","DB 292Grafit refleks"]
[292,"DB 292",5800,"Płytowe","Simple","Lustro weneckie","DB 292Lustro weneckie"]
[292,"DB 292",6000,"Płytowe","Simple","Mleczne","DB 292Mleczne"]
[292,"DB 292",6000,"Płytowe","Simple","Piaskowane refleks","DB 292Piaskowane refleks"]
[293,"DB 293",5700,"Płytowe","Simple","Przezierne","DB 293Przezierne"]
[293,"DB 293",5700,"Płytowe","Simple","Brąz refleks","DB 293Brąz refleks"]
[293,"DB 293",5800,"Płytowe","Simple","Grafit refleks","DB 293Grafit refleks"]
[293,"DB 293",5800,"Płytowe","Simple","Lustro weneckie","DB 293Lustro weneckie"]
[293,"DB 293",6000,"Płytowe","Simple","Mleczne","DB 293Mleczne"]
[293,"DB 293",6000,"Płytowe","Simple","Piaskowane refleks","DB 293Piaskowane refleks"]
[296,"DB 296",5700,"Płytowe","Simple","Przezierne","DB 296Przezierne"]
[296,"DB 296",5700,"Płytowe","Simple","Brąz refleks","DB 296Brąz refleks"]
[296,"DB 296",5800,"Płytowe","Simple","Grafit refleks","DB 296Grafit refleks"]
[296,"DB 296",5800,"Płytowe","Simple","Lustro weneckie","DB 296Lustro weneckie"]
[296,"DB 296",6000,"Płytowe","Simple","Mleczne","DB 296Mleczne"]
[296,"DB 296",6000,"Płytowe","Simple","Piaskowane refleks","DB 296Piaskowane refleks"]
[297,"DB 297",5700,"Płytowe","Simple","Przezierne","DB 297Przezierne"]
[297,"DB 297",5700,"Płytowe","Simple","Brąz refleks","DB 297Brąz refleks"]
[297,"DB 297",5800,"Płytowe","Simple","Grafit refleks","DB 297Grafit refleks"]
[297,"DB 297",5800,"Płytowe","Simple","Lustro weneckie","DB 297Lustro weneckie"]
[297,"DB 297",6000,"Płytowe","Simple","Mleczne","DB 297Mleczne"]
[297,"DB 297",6000,"Płytowe","Simple","Piaskowane refleks","DB 297Piaskowane refleks"]
[298,"DB 298",5700,"Płytowe","Simple","Przezierne","DB 298Przezierne"]
[298,"DB 298",5700,"Płytowe","Simple","Brąz refleks","DB 298Brąz refleks"]
[298,"DB 298",5800,"Płytowe","Simple","Grafit refleks","DB 298Grafit refleks"]
[298,"DB 298",5800,"Płytowe","Simple","Lustro weneckie","DB 298Lustro weneckie"]
[298,"DB 298",6000,"Płytowe","Simple","Mleczne",{"$f":"B550&F550","v":"DB 298Mleczne"}]
[298,"DB 298",6000,"Płytowe","Simple","Piaskowane refleks","DB 298Piaskowane refleks"]
[299,"DB 299",5700,"Płytowe","Simple","Przezierne","DB 299Przezierne"]
[299,"DB 299",5700,"Płytowe","Simple","Brąz refleks","DB 299Brąz refleks"]
[299,"DB 299",5800,"Płytowe","Simple","Grafit refleks","DB 299Grafit refleks"]
[299,"DB 299",5800,"Płytowe","Simple","Lustro weneckie","DB 299Lustro weneckie"]
[299,"DB 299",6000,"Płytowe","Simple","Mleczne","DB 299Mleczne"]
[325,"DB 325a",5900,"Płytowe","Simple Inox","Przezierne","DB 325aPrzezierne",200]
[325,"DB 325a",5900,"Płytowe","Simple Inox","Brąz refleks","DB 325aBrąz refleks",200]
[325,"DB 325a",6000,"Płytowe","Simple Inox","Grafit refleks","DB 325aGrafit refleks",200]
[325,"DB 325a",6000,"Płytowe","Simple Inox","Lustro weneckie","DB 325aLustro weneckie",200]
[325,"DB 325a",6200,"Płytowe","Simple Inox","Mleczne","DB 325aMleczne",200]
[325,"DB 325a",6200,"Płytowe","Simple Inox","Piaskowane refleks","DB 325aPiaskowane refleks",200]
[326,"DB 326",5900,"Płytowe","Simple Inox","Przezierne","DB 326Przezierne",200]
[326,"DB 326",5900,"Płytowe","Simple Inox","Brąz refleks","DB 326Brąz refleks",200]
[326,"DB 326",6000,"Płytowe","Simple Inox","Grafit refleks","DB 326Grafit refleks",200]
[326,"DB 326",6000,"Płytowe","Simple Inox","Lustro weneckie","DB 326Lustro weneckie",200]
[326,"DB 326",6200,"Płytowe","Simple Inox","Mleczne","DB 326Mleczne",200]
[327,"DB 327",5900,"Płytowe","Simple Inox","Przezierne","DB 327Przezierne",200]
[327,"DB 327",5900,"Płytowe","Simple Inox","Brąz refleks","DB 327Brąz refleks",200]
[327,"DB 327",6000,"Płytowe","Simple Inox","Grafit refleks","DB 327Grafit refleks",200]
[327,"DB 327",6000,"Płytowe","Simple Inox","Lustro weneckie","DB 327Lustro weneckie",200]
[327,"DB 327",6200,"Płytowe","Simple Inox","Mleczne","DB 327Mleczne",200]
[328,"DB 328",5900,"Płytowe","Simple Inox","Przezierne","DB 328Przezierne",200]
[328,"DB 328",5900,"Płytowe","Simple Inox","Brąz refleks","DB 328Brąz refleks",200]
[328,"DB 328",6000,"Płytowe","Simple Inox","Grafit refleks","DB 328Grafit refleks",200]
[328,"DB 328",6000,"Płytowe","Simple Inox","Lustro weneckie","DB 328Lustro weneckie",200]
[328,"DB 328",6200,"Płytowe","Simple Inox","Mleczne","DB 328Mleczne",200]
[328,"DB 328",6200,"Płytowe","Simple Inox","Piaskowane refleks","DB 328Piaskowane refleks",200]
[329,"DB 329",6100,"Płytowe","Simple Inox","Przezierne","DB 329Przezierne",200]
[329,"DB 329",6100,"Płytowe","Simple Inox","Brąz refleks","DB 329Brąz refleks",200]
[329,"DB 329",6200,"Płytowe","Simple Inox","Grafit refleks","DB 329Grafit refleks",200]
[329,"DB 329",6200,"Płytowe","Simple Inox","Lustro weneckie","DB 329Lustro weneckie",200]
[329,"DB 329",6400,"Płytowe","Simple Inox","Mleczne","DB 329Mleczne",200]
[330,"DB 330",6100,"Płytowe","Simple Inox","Przezierne","DB 330Przezierne",200]
[330,"DB 330",6100,"Płytowe","Simple Inox","Brąz refleks","DB 330Brąz refleks",200]
[330,"DB 330",6200,"Płytowe","Simple Inox","Grafit refleks","DB 330Grafit refleks",200]
[330,"DB 330",6200,"Płytowe","Simple Inox","Lustro weneckie","DB 330Lustro weneckie",200]
[330,"DB 330",6400,"Płytowe","Simple Inox","Mleczne","DB 330Mleczne",200]
[331,"DB 331",6100,"Płytowe","Simple Inox","Przezierne","DB 331Przezierne",300]
[331,"DB 331",6100,"Płytowe","Simple Inox","Brąz refleks","DB 331Brąz refleks",300]
[331,"DB 331",6200,"Płytowe","Simple Inox","Grafit refleks","DB 331Grafit refleks",300]
[331,"DB 331",6200,"Płytowe","Simple Inox","Lustro weneckie","DB 331Lustro weneckie",300]
[331,"DB 331",6400,"Płytowe","Simple Inox","Mleczne","DB 331Mleczne",300]
[332,"DB 332",6100,"Płytowe","Simple Inox","Przezierne","DB 332Przezierne",300]
[332,"DB 332",6100,"Płytowe","Simple Inox","Brąz refleks","DB 332Brąz refleks",300]
[332,"DB 332",6200,"Płytowe","Simple Inox","Grafit refleks","DB 332Grafit refleks",300]
[332,"DB 332",6200,"Płytowe","Simple Inox","Lustro weneckie","DB 332Lustro weneckie",300]
[332,"DB 332",6400,"Płytowe","Simple Inox","Mleczne","DB 332Mleczne",300]
[332,"DB 332",6400,"Płytowe","Simple Inox","Piaskowane refleks","DB 332Piaskowane refleks",300]
[333,"DB 333",5500,"Płytowe","Simple Inox","Brak (pełne)","DB 333Brak (pełne)",200]
[334,"DB 334",5900,"Płytowe","Simple Inox","Przezierne","DB 334Przezierne",200]
[334,"DB 334",5900,"Płytowe","Simple Inox","Brąz refleks","DB 334Brąz refleks",200]
[334,"DB 334",6000,"Płytowe","Simple Inox","Grafit refleks","DB 334Grafit refleks",200]
[334,"DB 334",6000,"Płytowe","Simple Inox","Lustro weneckie","DB 334Lustro weneckie",200]
[334,"DB 334",6200,"Płytowe","Simple Inox","Mleczne","DB 334Mleczne",200]
[338,"DB 338",6100,"Płytowe","Simple Inox","Przezierne","DB 338Przezierne",300]
[338,"DB 338",6100,"Płytowe","Simple Inox","Brąz refleks","DB 338Brąz refleks",300]
[338,"DB 338",6200,"Płytowe","Simple Inox","Grafit refleks","DB 338Grafit refleks",300]
[338,"DB 338",6200,"Płytowe","Simple Inox","Lustro weneckie","DB 338Lustro weneckie",300]
[338,"DB 338",6400,"Płytowe","Simple Inox","Mleczne","DB 338Mleczne",300]
[338,"DB 338",6400,"Płytowe","Simple Inox","Piaskowane refleks","DB 338Piaskowane refleks",300]
[345,"DB 345",5900,"Płytowe","Simple Inox","Przezierne","DB 345Przezierne",200]
[345,"DB 345",5900,"Płytowe","Simple Inox","Brąz refleks",{"$f":"B613&F613","v":"DB 345Brąz refleks"},200]
[345,"DB 345",6000,"Płytowe","Simple Inox","Grafit refleks","DB 345Grafit refleks",200]
[345,"DB 345",6000,"Płytowe","Simple Inox","Lustro weneckie","DB 345Lustro weneckie",200]
[345,"DB 345",6200,"Płytowe","Simple Inox","Mleczne","DB 345Mleczne",200]
[345,"DB 345",6200,"Płytowe","Simple Inox","Piaskowane refleks","DB 345Piaskowane refleks",200]
[350,"DB 350",6100,"Płytowe","Simple Inox","Przezierne","DB 350Przezierne",300]
[350,"DB 350",6100,"Płytowe","Simple Inox","Brąz refleks","DB 350Brąz refleks",300]
[350,"DB 350",6200,"Płytowe","Simple Inox","Grafit refleks","DB 350Grafit refleks",300]
[350,"DB 350",6200,"Płytowe","Simple Inox","Lustro weneckie","DB 350Lustro weneckie",300]
[350,"DB 350",6400,"Płytowe","Simple Inox","Mleczne","DB 350Mleczne",300]
[359,"DB 359",5900,"Płytowe","Simple Inox","Przezierne","DB 359Przezierne",200]
[359,"DB 359",5900,"Płytowe","Simple Inox","Brąz refleks","DB 359Brąz refleks",200]
[359,"DB 359",6000,"Płytowe","Simple Inox","Grafit refleks","DB 359Grafit refleks",200]
[359,"DB 359",6000,"Płytowe","Simple Inox","Lustro weneckie","DB 359Lustro weneckie",200]
[359,"DB 359",6200,"Płytowe","Simple Inox","Mleczne","DB 359Mleczne",200]
[359,"DB 359",6200,"Płytowe","Simple Inox","Piaskowane refleks","DB 359Piaskowane refleks",200]
[360,"DB 360",5900,"Płytowe","Simple Inox","Przezierne","DB 360Przezierne",200]
[360,"DB 360",5900,"Płytowe","Simple Inox","Brąz refleks","DB 360Brąz refleks",200]
[360,"DB 360",6000,"Płytowe","Simple Inox","Grafit refleks","DB 360Grafit refleks",200]
[360,"DB 360",6000,"Płytowe","Simple Inox","Lustro weneckie","DB 360Lustro weneckie",200]
[360,"DB 360",6200,"Płytowe","Simple Inox","Mleczne","DB 360Mleczne",200]
[360,"DB 360",6200,"Płytowe","Simple Inox","Piaskowane refleks","DB 360Piaskowane refleks",200]
[361,"DB 361",5900,"Płytowe","Simple Inox","Przezierne","DB 361Przezierne",200]
[361,"DB 361",5900,"Płytowe","Simple Inox","Brąz refleks","DB 361Brąz refleks",200]
[361,"DB 361",6000,"Płytowe","Simple Inox","Grafit refleks","DB 361Grafit refleks",200]
[361,"DB 361",6000,"Płytowe","Simple Inox","Lustro weneckie","DB 361Lustro weneckie",200]
[361,"DB 361",6200,"Płytowe","Simple Inox","Mleczne","DB 361Mleczne",200]
[361,"DB 361",6200,"Płytowe","Simple Inox","Piaskowane refleks","DB 361Piaskowane refleks",200]
[363,"DB 363",6100,"Płytowe","Simple Inox","Przezierne","DB 363Przezierne",300]
[363,"DB 363",6100,"Płytowe","Simple Inox","Brąz refleks","DB 363Brąz refleks",300]
[363,"DB 363",6200,"Płytowe","Simple Inox","Grafit refleks","DB 363Grafit refleks",300]
[363,"DB 363",6200,"Płytowe","Simple Inox","Lustro weneckie","DB 363Lustro weneckie",300]
[363,"DB 363",6400,"Płytowe","Simple Inox","Mleczne","DB 363Mleczne",300]
[363,"DB 363",6400,"Płytowe","Simple Inox","Piaskowane refleks","DB 363Piaskowane refleks",300]
[364,"DB 364",5900,"Płytowe","Simple Inox","Przezierne","DB 364Przezierne",300]
[364,"DB 364",5900,"Płytowe","Simple Inox","Brąz refleks","DB 364Brąz refleks",300]
[364,"DB 364",6000,"Płytowe","Simple Inox","Grafit refleks","DB 364Grafit refleks",300]
[364,"DB 364",6000,"Płytowe","Simple Inox","Lustro weneckie","DB 364Lustro weneckie",300]
[364,"DB 364",6200,"Płytowe","Simple Inox","Mleczne","DB 364Mleczne",300]
[364,"DB 364",6200,"Płytowe","Simple Inox","Piaskowane refleks","DB 364Piaskowane refleks",300]
[366,"DB 366",5500,"Płytowe","Simple Inox","Brak (pełne)","DB 366Brak (pełne)",200]
[400,"DB 400",5700,"Płytowe","Prestige Kamień","Przezierne","DB 400Przezierne",null,1000]
[400,"DB 400",5700,"Płytowe","Prestige Kamień","Brąz refleks","DB 400Brąz refleks",null,1000]
[400,"DB 400",5800,"Płytowe","Prestige Kamień","Grafit refleks","DB 400Grafit refleks",null,1000]
[400,"DB 400",5800,"Płytowe","Prestige Kamień","Lustro weneckie","DB 400Lustro weneckie",null,1000]
[400,"DB 400",6000,"Płytowe","Prestige Kamień","Mleczne","DB 400Mleczne",null,1000]
[400,"DB 400",6000,"Płytowe","Prestige Kamień","Piaskowane refleks","DB 400Piaskowane refleks",null,1000]
[405,"DB 405",6000,"Płytowe","Prestige Kamień","Przezierne","DB 405Przezierne",null,1000]
[405,"DB 405",6000,"Płytowe","Prestige Kamień","Brąz refleks","DB 405Brąz refleks",null,1000]
[405,"DB 405",6100,"Płytowe","Prestige Kamień","Grafit refleks","DB 405Grafit refleks",null,1000]
[405,"DB 405",6100,"Płytowe","Prestige Kamień","Lustro weneckie","DB 405Lustro weneckie",null,1000]
[405,"DB 405",6300,"Płytowe","Prestige Kamień","Mleczne","DB 405Mleczne",null,1000]
[411,"DB 411",6000,"Płytowe","Prestige Kamień","Przezierne","DB 411Przezierne",null,1200]
[411,"DB 411",6000,"Płytowe","Prestige Kamień","Brąz refleks","DB 411Brąz refleks",null,1200]
[411,"DB 411",6100,"Płytowe","Prestige Kamień","Grafit refleks","DB 411Grafit refleks",null,1200]
[411,"DB 411",6100,"Płytowe","Prestige Kamień","Lustro weneckie","DB 411Lustro weneckie",null,1200]
[411,"DB 411",6300,"Płytowe","Prestige Kamień","Mleczne","DB 411Mleczne",null,1200]
[412,"DB 412",5300,"Płytowe","Prestige Kamień","Brak (pełne)","DB 412Brak (pełne)",null,1000]
[413,"DB 413",5300,"Płytowe","Prestige Kamień","Brak (pełne)","DB 413Brak (pełne)",null,1000]
[414,"DB 414",5300,"Płytowe","Prestige Kamień","Brak (pełne)","DB 414Brak (pełne)",null,2000]
[415,"DB 415",6000,"Płytowe","Prestige Kamień","Brak (pełne)",{"$f":"B673&F673","v":"DB 415Brak (pełne)"},null,2500]
[431,"DB 431",5700,"Płytowe","Prestige Kamień","Przezierne","DB 431Przezierne",null,1000]
[431,"DB 431",5700,"Płytowe","Prestige Kamień","Brąz refleks","DB 431Brąz refleks",null,1000]
[431,"DB 431",5800,"Płytowe","Prestige Kamień","Grafit refleks","DB 431Grafit refleks",null,1000]
[431,"DB 431",5800,"Płytowe","Prestige Kamień","Lustro weneckie","DB 431Lustro weneckie",null,1000]
[431,"DB 431",6000,"Płytowe","Prestige Kamień","Mleczne","DB 431Mleczne",null,1000]
[432,"DB 432",5700,"Płytowe","Prestige Kamień","Przezierne","DB 432Przezierne",null,1000]
[432,"DB 432",5700,"Płytowe","Prestige Kamień","Brąz refleks","DB 432Brąz refleks",null,1000]
[432,"DB 432",5800,"Płytowe","Prestige Kamień","Grafit refleks","DB 432Grafit refleks",null,1000]
[432,"DB 432",5800,"Płytowe","Prestige Kamień","Lustro weneckie","DB 432Lustro weneckie",null,1000]
[432,"DB 432",6000,"Płytowe","Prestige Kamień","Mleczne","DB 432Mleczne",null,1000]
[432,"DB 432",6000,"Płytowe","Prestige Kamień","Piaskowane refleks","DB 432Piaskowane refleks",null,1000]
[450,"DB 450",5700,"Płytowe","Prestige Kamień","Przezierne","DB 450Przezierne",null,1000]
[450,"DB 450",5700,"Płytowe","Prestige Kamień","Brąz refleks","DB 450Brąz refleks",null,1000]
[450,"DB 450",5800,"Płytowe","Prestige Kamień","Grafit refleks","DB 450Grafit refleks",null,1000]
[450,"DB 450",5800,"Płytowe","Prestige Kamień","Lustro weneckie","DB 450Lustro weneckie",null,1000]
[450,"DB 450",6000,"Płytowe","Prestige Kamień","Mleczne","DB 450Mleczne",null,1000]
[502,"DB 502",6500,"Płytowe","Prestige Glass","Dyskretne brąz refleks","DB 502Dyskretne brąz refleks"]
[502,"DB 502",6500,"Płytowe","Prestige Glass","Dyskretne grafit refleks","DB 502Dyskretne grafit refleks"]
[502,"DB 502",6500,"Płytowe","Prestige Glass","Dyskretne lustrzane","DB 502Dyskretne lustrzane"]
[502,"DB 502",6500,"Płytowe","Prestige Glass","Dyskretne lustro weneckie w głębi","DB 502Dyskretne lustro weneckie w głębi"]
[506,"DB 506",6500,"Płytowe","Prestige Glass","Dyskretne brąz refleks","DB 506Dyskretne brąz refleks"]
[506,"DB 506",6500,"Płytowe","Prestige Glass","Dyskretne grafit refleks","DB 506Dyskretne grafit refleks"]
[506,"DB 506",6500,"Płytowe","Prestige Glass","Dyskretne lustrzane","DB 506Dyskretne lustrzane"]
[506,"DB 506",6500,"Płytowe","Prestige Glass","Dyskretne lustro weneckie w głębi","DB 506Dyskretne lustro weneckie w głębi"]
[510,"DB 510",6500,"Płytowe","Prestige Glass","Dyskretne brąz refleks","DB 510Dyskretne brąz refleks"]
[510,"DB 510",6500,"Płytowe","Prestige Glass","Dyskretne grafit refleks","DB 510Dyskretne grafit refleks"]
[510,"DB 510",6500,"Płytowe","Prestige Glass","Dyskretne lustrzane","DB 510Dyskretne lustrzane"]
[510,"DB 510",6500,"Płytowe","Prestige Glass","Dyskretne lustro weneckie w głębi","DB 510Dyskretne lustro weneckie w głębi"]
[511,"DB 511",6500,"Płytowe","Prestige Glass","Dyskretne brąz refleks","DB 511Dyskretne brąz refleks"]
[511,"DB 511",6500,"Płytowe","Prestige Glass","Dyskretne grafit refleks","DB 511Dyskretne grafit refleks"]
[511,"DB 511",6500,"Płytowe","Prestige Glass","Dyskretne lustrzane","DB 511Dyskretne lustrzane"]
[511,"DB 511",6500,"Płytowe","Prestige Glass","Dyskretne lustro weneckie w głębi","DB 511Dyskretne lustro weneckie w głębi"]
[512,"DB 512",6500,"Płytowe","Prestige Glass","Dyskretne brąz refleks","DB 512Dyskretne brąz refleks"]
[512,"DB 512",6500,"Płytowe","Prestige Glass","Dyskretne grafit refleks","DB 512Dyskretne grafit refleks"]
[512,"DB 512",6500,"Płytowe","Prestige Glass","Dyskretne lustrzane","DB 512Dyskretne lustrzane"]
[512,"DB 512",6500,"Płytowe","Prestige Glass","Dyskretne lustro weneckie w głębi","DB 512Dyskretne lustro weneckie w głębi"]
[513,"DB 513",6500,"Płytowe","Prestige Glass","Dyskretne brąz refleks","DB 513Dyskretne brąz refleks"]
[513,"DB 513",6500,"Płytowe","Prestige Glass","Dyskretne grafit refleks","DB 513Dyskretne grafit refleks"]
[513,"DB 513",6500,"Płytowe","Prestige Glass","Dyskretne lustrzane","DB 513Dyskretne lustrzane"]
[513,"DB 513",6500,"Płytowe","Prestige Glass","Dyskretne lustro weneckie w głębi","DB 513Dyskretne lustro weneckie w głębi"]
[514,"DB 514",6500,"Płytowe","Prestige Glass","Dyskretne brąz refleks","DB 514Dyskretne brąz refleks"]
[514,"DB 514",6500,"Płytowe","Prestige Glass","Dyskretne grafit refleks","DB 514Dyskretne grafit refleks"]
[514,"DB 514",6500,"Płytowe","Prestige Glass","Dyskretne lustrzane","DB 514Dyskretne lustrzane"]
[514,"DB 514",6500,"Płytowe","Prestige Glass","Dyskretne lustro weneckie w głębi","DB 514Dyskretne lustro weneckie w głębi"]
[515,"DB 515",6500,"Płytowe","Prestige Glass","Dyskretne brąz refleks","DB 515Dyskretne brąz refleks"]
[515,"DB 515",6500,"Płytowe","Prestige Glass","Dyskretne grafit refleks","DB 515Dyskretne grafit refleks"]
[515,"DB 515",6500,"Płytowe","Prestige Glass","Dyskretne lustrzane","DB 515Dyskretne lustrzane"]
[515,"DB 515",6500,"Płytowe","Prestige Glass","Dyskretne lustro weneckie w głębi","DB 515Dyskretne lustro weneckie w głębi"]
[516,"DB 516",6500,"Płytowe","Prestige Glass","Dyskretne brąz refleks","DB 516Dyskretne brąz refleks"]
[516,"DB 516",6500,"Płytowe","Prestige Glass","Dyskretne grafit refleks","DB 516Dyskretne grafit refleks"]
[516,"DB 516",6500,"Płytowe","Prestige Glass","Dyskretne lustrzane","DB 516Dyskretne lustrzane"]
[516,"DB 516",6500,"Płytowe","Prestige Glass","Dyskretne lustro weneckie w głębi","DB 516Dyskretne lustro weneckie w głębi"]
[517,"DB 517",6500,"Płytowe","Prestige Glass","Dyskretne brąz refleks",{"$f":"B726&F726","v":"DB 517Dyskretne brąz refleks"}]
[517,"DB 517",6500,"Płytowe","Prestige Glass","Dyskretne grafit refleks","DB 517Dyskretne grafit refleks"]
[517,"DB 517",6500,"Płytowe","Prestige Glass","Dyskretne lustrzane","DB 517Dyskretne lustrzane"]
[517,"DB 517",6500,"Płytowe","Prestige Glass","Dyskretne lustro weneckie w głębi","DB 517Dyskretne lustro weneckie w głębi"]
[601,"DB 601",6000,"Płytowe","Maverick","Brak (pełne)","DB 601Brak (pełne)"]
[602,"DB 602",5300,"Płytowe","Maverick","Brak (pełne)","DB 602Brak (pełne)"]
[603,"DB 603",5300,"Płytowe","Maverick","Brak (pełne)","DB 603Brak (pełne)"]
[604,"DB 604",5300,"Płytowe","Maverick","Brak (pełne)","DB 604Brak (pełne)"]
[605,"DB 605",6500,"Płytowe","Maverick","Dyskretne brąz refleks","DB 605Dyskretne brąz refleks"]
[605,"DB 605",6500,"Płytowe","Maverick","Dyskretne grafit refleks","DB 605Dyskretne grafit refleks"]
[605,"DB 605",6500,"Płytowe","Maverick","Dyskretne lustrzane","DB 605Dyskretne lustrzane"]
[605,"DB 605",6500,"Płytowe","Maverick","Dyskretne lustro weneckie w głębi","DB 605Dyskretne lustro weneckie w głębi"]
[606,"DB 606",7000,"Płytowe","Maverick","Dyskretne brąz refleks","DB 606Dyskretne brąz refleks"]
[606,"DB 606",7000,"Płytowe","Maverick","Dyskretne grafit refleks","DB 606Dyskretne grafit refleks"]
[606,"DB 606",7000,"Płytowe","Maverick","Dyskretne lustrzane","DB 606Dyskretne lustrzane"]
[606,"DB 606",7000,"Płytowe","Maverick","Dyskretne lustro weneckie w głębi","DB 606Dyskretne lustro weneckie w głębi"]
[607,"DB 607",6000,"Płytowe","Maverick","Brak (pełne)","DB 607Brak (pełne)"]
[609,"DB 609",5300,"Płytowe","Maverick","Brak (pełne)","DB 609Brak (pełne)"]

{"sheet":"Mapping","index":2,"n_rows":232,"n_cols":266,"rows_kept":232,"cut":false,"hidden":true,"merged":[]}
["Modele",null,null,null,null,null,null,null,null,null,null,null,"Szklenie",null,null,null,"Wykończenie",null,null,null,null,"Ilość kolorów",null,null,"Kolor",null,null,null,null,null,"Inox dustronny",null,null,null,"Rodzaj kamienia",null,null,null,"Przylgowość",null,null,null,null,"Grubosc",null,null,null,null,null,"Szerokość i dostawki",null,null,null,null,null,"Wysokość i naświetla",null,null,null,null,null,null,"Kierunek otwierania",null,null,null,"Dostawki",null,null,null,null,null,"Naświetle",null,null,null,null,null,null,null,null,null,null,null,null,null,null,"Ościeżnica rodzaj",null,null,null,null,"Aplikacja Retro",null,null,null,null,null,null,null,"Grubość górna standard [cm]",null,null,null,null,null,null,null,"Grubość boczna ościeżnicy",null,null,null,null,null,null,null,null,null,null,null,"Szerokość ościeznicy cm",null,null,null,null,null,"Obróbki",null,"Opaska wewnętrzna",null,null,"Opaska zewnętrzna",null,null,null,null,"Listwa maskująca",null,null,"Ćwierćwałek",null,null,"Skrzydło szerokość (tu będzie można wpisać swój wymiar)",null,null,null,null,null,"Skrzydło wysokość (tu będzie można wpisać swój wymiar)",null,null,null,null,null,"Dostawki cena",null,null,null,null,null,"Szklenie dostawkach",null,null,null,null,null,null,null,null,"pola szkła",null,null,null,null,null,null,null,null,"Okucia",null,null,null,null,null,null,1,2,3,4,5,6,null,null,null,null,null,null,null,null,null,null,null,null,null,null,null,null,null,null,null,null,null,null,"Szyba P4",null,null,null,null,null,null,"PROGI",null,null,null,null,null,"Adapter",null,null,null,"Okapnik/Kopniak",null,null,null,null,null,null,null,"Wizjer",null,null,"Samozamykacz",null,null,"Kołatka",null,null,"Piaskowanie numery na szkle",null,null,"Kontrakton",null,null,"Zestaw pielęgnacyjny",null,null,"Rabat",null,"Montaż",null,"VAT",null,"Kolor zawiasów"]
["lista"," dostawka w ościeżnicy nowoczesna \npełna - minimalna szerokość"," dostawka w ościeżnicy nowoczesna \n szklana - minimalna szerokość"," dostawka w ościeżnicy tradycyjna \npełna - minimalna szerokość"," dostawka w ościeżnicy tradycyjna \nszklana - minimalna szerokość"," dostawka w imitacji skrzydła stała pełna - minimalna szerokość"," dostawka w imitacji skrzydła stała szklana - minimalna szerokość"," dostawka w imitacji skrzydła ruchoma pełna - minimalna szerokość"," dostawka w imitacji skrzydła ruchoma szklana - minimalna szerokość","Mapping","Mapping na pełne",null,"funkcja","cena","mapping",null,"lista","cena","funkcja po konstrukcji","mapping",null,"lista","cena",null,"lista","cena","funkcja po konstrukcji","funkcja po wykończeniu","mapping",null,"lista","cena","mapping",null,"lista","cena","mapping",null,"lista","funkcja po konstrukcji","cena","mapping",null,"lista","funkcja po konstrukcji","funkcja po ościeżnicy","cena","mapping",null,"szerokość","102 dostawka","106 dostawka","dostawki po grubości","dostawki mapping",null,"wysokosc","102 naswietle","106 naswietle","naswietle po grubosci","naswietle mapping",null,null,"lista","funkcja po ościeżnicy","mapping",null,"lista","funkcja po konstrukcji","fukcja po linii (Kamień bez imitacji skrzydła)","funkcja po ościeżnicy (bezprzylgowa glass)","mapping",null,"lista","cena bez szkła","wysokość naświetla","dopłata do wysokości","funkcja po ościeżnicy","mapping","szkło naświetle","dopłata bazowa","cena finalna","szklenie po rodzaju naświetla","szklenie po opcji szklenia","maping szklenie","pola szkła",null,null,"lista","cena","funckja po ościeżnicy","mapping",null,"lista","cena","funkcja po krosnowej","funkcja po ościeżnicy","funkcja po dostawkach","funkcja po naświetlu","mapping",null,"vlookup rodzaj","grubość","vlookup ościeżnicy","funkcja po grubosci","lista wybór","funkcja po warunku minimum","mapping",null,"vlookup rodzaj","grubość","vlookup ościeżnicy","funkcja po grubosci ościeżnicy od zawias","funkcja po grubosci ościeżnicy od zamka",null,"lista wybór","funkcja po warunku minimum od zawias","mapping od zawias","funkcja po warunku minimum od zamka","mapping od zamka",null,"vlookup rodzaj","szerokość","lista wybór","funkcja po warunku minimum","mapping",null,"lista wybór",null,"lista","cena",null,"lista","cena","funkcja po ościeżnicy","mapping",null,"lista","cena",null,"lista","cena",null,"lista","pod wymiar","cena","funkcja po dostawce","mapping",null,"lista","pod wymiar","cena","funkcja po naświetlu","mapping",null,"szerokość","pod wymiar","procenty od zawias","procenty od zamka","naświetle","wylicznie pod naświetla","lista","dopłata szklenie","opcje szklenia po rodzaju dostawki\ndostawka od zawias","opcje jeśli w ogóle jest jakaś dostawka od zawias","mapping od zawias","opcje szklenia po rodzaju dostawki\ndostawka od zamka","opcje jeśli w ogóle jest jakaś dostawka od zamka","mapping od zamka",null,"ilość za free ","lista","funkcja po wyborze od zawias","mapping od zawias","fukca po wyborze od zamka","mapping od zamka","funkcja po naświetlu","mapping po naświetlu",null,"Specjalny zestaw lista","cena","Zamek po zestawie","zamek mapping","Okucie zewnętrzne lista","Cena","Okucia po konstrukcji","Brak (standard)","Zestaw elektronik z zamkiem ryglowym","Zestaw elektronik z zamkiem automatycznym","Zestaw z pochwytem na styl amerykański","Zestaw antywłamaniowy RC2","Wszystkie czytniki","Okucia po zestawie","Numeracja pomocnicza","Mapping okucia","Tabela okucia a kolor (1/2)","Tabela okucia a kolor (2/2)","Kolor okucia funkcja","Kolor okucia mapping","Długość antaby","Długość mapping","Wkładki lista","Cena wkładki","Wkładki po zestawie","Wkładka mapping","Zapadka","Cena","funkcja po zapadce","po okuciu (dla klamek nie)","mapping zapadka","Listwa zaczepowa","cena ","mapping listwa",null,"lista opcji","Cena podstawowa","Cena po uwzględniu RC2","funkcja po skrzydle (czy pełne czy nie)","funkcja po konstrukcji","mapping P4",null,"lista","cena bazowa","cena pod dostawkach","funkcja po kierunku otwierania","mapping progi",null,"lista","Cena bazowa","Cena po dostawkach",null,"Według ilości dostawek","Cena bezowa okapnik","Cena po konstrucji\nokapnik","cena bazowa kopniak","cena po konstrukcji kopniak","funkcja po konstrukcji","mapping okapnik/kopniak",null,"lista","Cena",null,"lista","cena",null,"lista","cena",null,"lista","cena",null,"lista","cena",null,"lista","cena",null,"lista",null,"lista",null,"lista",null,"Kolor zawiasów","Kolor po przylgowości","Cena","Mapping"]
["DB 01",20,20,20,20,44,44,44,44,"W ościeżnicy nowoczesna",2,null,{"$f":"IFERROR(VLOOKUP(Wycena!$C$5,OFFSET(SKU!$B$1,MATCH(Wycena!$C$5,SKU!$B$1:$B$743,0)-1,0,1000,6),5,0),\"\")","v":""},{"$f":"IFERROR(VLOOKUP(Wycena!$C$5,OFFSET(SKU!$B$1,MATCH(Wycena!$C$5,SKU!$B$1:$B$743,0)-1,0,1000,6),2,0)-VLOOKUP(Wycena!$C$5,SKU!$B$1:$C$743,2,0),\"\")","v":""},{"$f":"IF(ROWS($M$3:M3)>(ROWS($M$3:$M$10)-COUNTBLANK($M$3:$M$10)),\"\",INDEX($M$3:$M$10,SMALL(IF($M$3:$M$10<>\"\",ROW($M$3:$M$10)-2),ROWS($M$3:M3))))","v":""},null,"Dab prosty podluzny",0,"Dab prosty podluzny",{"$f":"IF(ROWS($S$3:S3)>(ROWS($S$3:$S$8)-COUNTBLANK($S$3:$S$8)),\"\",INDEX($S$3:$S$8,SMALL(IF($S$3:$S$8<>\"\",ROW($S$3:$S$8)-2),ROWS($S$3:S3))))","v":{"$error":"#N/A"}},null,"Jeden (standard)",0,null,"Afromozja",0,{"$f":"Y3","v":"Afromozja"},{"$f":"IF((VLOOKUP(Wycena!$C$7,Mapping!$Q$15:$R$20,2,0))=\"tak\",\"\",AA3)","v":"Afromozja"},{"$f":"IF(ROWS($AB$3:AB3)>(ROWS($AB$3:$AB$229)-COUNTBLANK($AB$3:$AB$229)),\"\",INDEX($AB$3:$AB$229,SMALL(IF($AB$3:$AB$229<>\"\",ROW($AB$3:$AB$229)-2),ROWS($AB$3:AB3))))","v":{"$error":"#N/A"}},null,{"$f":"IF(VLOOKUP(Wycena!C5,SKU!$B$1:$H$743,7,0)>0,\"Tak\",\"\")","v":{"$error":"#N/A"}},{"$f":"IF(AE3=\"Tak\",VLOOKUP(Wycena!$C$5,SKU!$B$1:$H$743,7,0),0)","v":{"$error":"#N/A"}},{"$f":"IF(ROWS($AE$3:AE3)>(ROWS($AE$3:$AE$4)-COUNTBLANK($AE$3:$AE$4)),\"\",INDEX($AE$3:$AE$4,SMALL(IF($AE$3:$AE$4<>\"\",ROW($AE$3:$AE$4)-2),ROWS($AE$3:AE3))))","v":{"$error":"#N/A"}},null,{"$f":"IF(VLOOKUP(Wycena!$C$5,SKU!$B$1:$I$743,8,0)>0,\"Brąz rdzawy\",\"-\")","v":{"$error":"#N/A"}},{"$f":"VLOOKUP(Wycena!$C$5,SKU!$B$1:$I$743,8,0)","v":{"$error":"#N/A"}},{"$f":"IF(ROWS($AI$3:AI3)>(ROWS($AI$3:$AI$7)-COUNTBLANK($AI$3:$AI$7)),\"\",INDEX($AI$3:$AI$7,SMALL(IF($AI$3:$AI$7<>\"\",ROW($AI$3:$AI$7)-2),ROWS($AI$3:AI3))))","v":{"$error":"#N/A"}},null,"Przylgowe","Przylgowe",0,{"$f":"IF(ROWS($AN$3:AN3)>(ROWS($AN$3:$AN$5)-COUNTBLANK($AN$3:$AN$5)),\"\",INDEX($AN$3:$AN$5,SMALL(IF($AN$3:$AN$5<>\"\",ROW($AN$3:$AN$5)-2),ROWS($AN$3:AN3))))","v":{"$error":"#N/A"}},null,78,78,{"$f":"IF(Wycena!C14=\"Przylgowe\",Mapping!AS3,\"\")","v":78},0,{"$f":"IF(ROWS($AT$3:AT3)>(ROWS($AT$3:$AT$5)-COUNTBLANK($AT$3:$AT$5)),\"\",INDEX($AT$3:$AT$5,SMALL(IF($AT$3:$AT$5<>\"\",ROW($AT$3:$AT$5)-2),ROWS($AT$3:AT3))))","v":78},null,72,0,0,{"$f":"IF(Wycena!$C$16=78,Mapping!AY3,AZ3)","v":0},0,"",180,0,0,{"$f":"IF(Wycena!$C$16=78,Mapping!BE3,BF3)","v":0},0,"",null,"Lewe na zewnątrz","Lewe na zewnątrz",{"$f":"IF(ROWS($BL$3:BL3)>(ROWS($BL$3:$BL$6)-COUNTBLANK($BL$3:$BL$6)),\"\",INDEX($BL$3:$BL$6,SMALL(IF($BL$3:$BL$6<>\"\",ROW($BL$3:$BL$6)-2),ROWS($BL$3:BL3))))","v":"Lewe na zewnątrz"},null,"-","-","-","-",{"$f":"IF(ROWS($BR$3:BR3)>(ROWS($BR$3:$BR$8)-COUNTBLANK($BR$3:$BR$8)),\"\",INDEX($BR$3:$BR$8,SMALL(IF($BR$3:$BR$8<>\"\",ROW($BR$3:$BR$8)-2),ROWS($BR$3:BR3))))","v":{"$error":"#N/A"}},null,"-",0,0,0,"-",{"$f":"IF(ROWS($BY$3:BY3)>(ROWS($BY$3:$BY$6)-COUNTBLANK($BY$3:$BY$6)),\"\",INDEX($BY$3:$BY$6,SMALL(IF($BY$3:$BY$6<>\"\",ROW($BY$3:$BY$6)-2),ROWS($BY$3:BY3))))","v":"-"},"Brak (pełne)",0,{"$f":"CB3*(1+IFERROR(VLOOKUP(Wycena!$C$45,Mapping!$EZ$3:$FC$6,4,1),0)+IFERROR(VLOOKUP(Wycena!$C$49,Mapping!$EZ$3:$FC$6,4,1),0))*(1+VLOOKUP(Wycena!$C$54,Mapping!$BW$3:$BX$6,2,1))","v":{"$error":"#N/A"}},"Brak (pełne)",{"$f":"IF(Wycena!$C$22=\"-\",\"-\",CD3)","v":"-"},{"$f":"IF(ROWS($CE$3:CE3)>(ROWS($CE$3:$CE$13)-COUNTBLANK($CE$3:$CE$13)),\"\",INDEX($CE$3:$CE$13,SMALL(IF($CE$3:$CE$13<>\"\",ROW($CE$3:$CE$13)-2),ROWS($CE$3:CE3))))","v":"-"},null,null,null,"Standardowa",0,"Standardowa",{"$f":"IF(ROWS($CL$3:CL3)>(ROWS($CL$3:$CL$4)-COUNTBLANK($CL$3:$CL$4)),\"\",INDEX($CL$3:$CL$4,SMALL(IF($CL$3:$CL$4<>\"\",ROW($CL$3:$CL$4)-2),ROWS($CL$3:CL3))))","v":"Standardowa"},null,"-",0,"-","-","-","-",{"$f":"IF(ROWS($CT$3:CT3)>(ROWS($CT$3:$CT$11)-COUNTBLANK($CT$3:$CT$11)),\"\",INDEX($CT$3:$CT$11,SMALL(IF($CT$3:$CT$11<>\"\",ROW($CT$3:$CT$11)-2),ROWS($CT$3:CT3))))","v":"-"},null,"standardowa",6,"Przylgowe",{"$f":"VLOOKUP(Wycena!$C$25,Mapping!$CW$3:$CX$4,2,0)","v":6},6,{"$f":"IF(DA3>=VLOOKUP(Wycena!$C$14,Mapping!$CY$3:$CZ$5,2,0),DA3,\"\")","v":6},{"$f":"IF(ROWS($DB$3:DB3)>(ROWS($DB$3:$DB$28)-COUNTBLANK($DB$3:$DB$28)),\"\",INDEX($DB$3:$DB$28,SMALL(IF($DB$3:$DB$28<>\"\",ROW($DB$3:$DB$28)-2),ROWS($DB$3:DB3))))","v":6},null,"standardowa",6,"Przylgowe",{"$f":"IF(OR(Wycena!$C$20=\"-\",Wycena!$C$20=\"Imitacja skrzydła ruchoma\"),(MAX((IFERROR(VLOOKUP(Wycena!C5,Mapping!$DG$21:$DH$23,2,0),0)),(VLOOKUP(Wycena!$C$25,Mapping!$CW$3:$CX$4,2,0)+VLOOKUP(Wycena!C26,$CO$16:$CS$25,IF(AND(Wycena!C20=\"-\",Wycena!C21=\"-\"),2,IF(AND(Wycena!C20<>\"-\",Wycena!C21=\"-\"),3,IF(AND(Wycena!C20=\"-\",Wycena!C21<>\"-\"),4,5))),0)))),(VLOOKUP(Wycena!$C$25,Mapping!$CW$3:$CX$4,2,0)+VLOOKUP(Wycena!C26,$CO$16:$CS$25,IF(AND(Wycena!C20=\"-\",Wycena!C21=\"-\"),2,IF(AND(Wycena!C20<>\"-\",Wycena!C21=\"-\"),3,IF(AND(Wycena!C20=\"-\",Wycena!C21<>\"-\"),4,5))),0)))","v":6},{"$f":"IF(Wycena!$C$21=\"Imitacja skrzydła ruchoma\",(MAX((IFERROR(VLOOKUP(Wycena!C5,Mapping!$DG$21:$DH$23,2,0),0)),(VLOOKUP(Wycena!$C$25,Mapping!$CW$3:$CX$4,2,0)+VLOOKUP(Wycena!C26,$CO$28:$CS$37,IF(AND(Wycena!C20=\"-\",Wycena!C21=\"-\"),2,IF(AND(Wycena!C20<>\"-\",Wycena!C21=\"-\"),3,IF(AND(Wycena!C20=\"-\",Wycena!C21<>\"-\"),4,5))),0)))),(VLOOKUP(Wycena!$C$25,Mapping!$CW$3:$CX$4,2,0)+VLOOKUP(Wycena!C26,$CO$28:$CS$37,IF(AND(Wycena!C20=\"-\",Wycena!C21=\"-\"),2,IF(AND(Wycena!C20<>\"-\",Wycena!C21=\"-\"),3,IF(AND(Wycena!C20=\"-\",Wycena!C21<>\"-\"),4,5))),0)))","v":6},null,6,{"$f":"IF(DK3>=VLOOKUP(Wycena!$C$14,Mapping!$DG$3:$DH$5,2,0),DK3,\"\")","v":6},{"$f":"IF(ROWS($DL$3:DL3)>(ROWS($DL$3:$DL$28)-COUNTBLANK($DL$3:$DL$28)),\"\",INDEX($DL$3:$DL$28,SMALL(IF($DL$3:$DL$28<>\"\",ROW($DL$3:$DL$28)-2),ROWS($DL$3:DL3))))","v":6},{"$f":"IF(DK3>=VLOOKUP(Wycena!$C$14,Mapping!$DG$3:$DI$5,3,0),DK3,\"\")","v":6},{"$f":"IF(ROWS($DN$3:DN3)>(ROWS($DN$3:$DN$28)-COUNTBLANK($DN$3:$DN$28)),\"\",INDEX($DN$3:$DN$28,SMALL(IF($DN$3:$DN$28<>\"\",ROW($DN$3:$DN$28)-2),ROWS($DN$3:DN3))))","v":6},null,"standardowa",10.5,6,{"$f":"IF(DS3>=VLOOKUP(Wycena!$C$25,Mapping!$DQ$3:$DR$4,2,0),DS3,\"\")","v":""},{"$f":"IF(ROWS($DT$3:DT3)>(ROWS($DT$3:$DT$28)-COUNTBLANK($DT$3:$DT$28)),\"\",INDEX($DT$3:$DT$28,SMALL(IF($DT$3:$DT$28<>\"\",ROW($DT$3:$DT$28)-2),ROWS($DT$3:DT3))))","v":10.5},null,"-",null,"-",0,null,"-",0,"-",{"$f":"IF(ROWS($ED$3:ED3)>(ROWS($ED$3:$ED$4)-COUNTBLANK($ED$3:$ED$4)),\"\",INDEX($ED$3:$ED$4,SMALL(IF($ED$3:$ED$4<>\"\",ROW($ED$3:$ED$4)-2),ROWS($ED$3:ED3))))","v":"-"},null,"-",0,null,"-",0,null,80,60,0,{"$f":"IF(OR(Wycena!$C$20<>\"-\",Wycena!$C$21<>\"-\",),EM3,IF((Wycena!$C$17-Wycena!$C$28-Wycena!$C$29)>118,\"-\",(Wycena!$C$17-Wycena!$C$28-Wycena!$C$29)))","v":90},{"$f":"IF(ROWS($EP$3:EP3)>(ROWS($EP$3:$EP$8)-COUNTBLANK($EP$3:$EP$8)),\"\",INDEX($EP$3:$EP$8,SMALL(IF($EP$3:$EP$8<>\"\",ROW($EP$3:$EP$8)-2),ROWS($EP$3:EP3))))","v":90},null,204,{"$f":"180-VLOOKUP(Wycena!$C$14,Mapping!$CY$3:$CZ$5,2,0)","v":174},0,{"$f":"IF(AND(Wycena!$C$22<>\"-\",ES3<=Wycena!$C$18-Wycena!$C$27),ES3,Wycena!$C$18-Wycena!$C$27)","v":204},{"$f":"IF(ROWS($EV$3:EV3)>(ROWS($EV$3:$EV$8)-COUNTBLANK($EV$3:$EV$8)),\"\",INDEX($EV$3:$EV$8,SMALL(IF($EV$3:$EV$8<>\"\",ROW($EV$3:$EV$8)-2),ROWS($EV$3:EV3))))","v":204},null,0,0,{"$f":"50%+IF(Wycena!$C$20=\"Imitacja skrzydła ruchoma\",0.1,0)","v":0.5},{"$f":"50%+IF(Wycena!$C$21=\"Imitacja skrzydła ruchoma\",0.1,0)","v":0.5},0.5,{"$f":"IFERROR(VLOOKUP(Wycena!$C$45,Mapping!$EZ$3:$FC$6,4,1)+VLOOKUP(Wycena!$C$49,Mapping!$EZ$3:$FC$6,4,1),0)","v":0},"Brak (pełne)",0,"Brak (pełne)",{"$f":"IF(Wycena!$C$20=\"-\",\"-\",FG3)","v":"-"},{"$f":"IF(ROWS($FH$3:FH3)>(ROWS($FH$3:$FH$14)-COUNTBLANK($FH$3:$FH$14)),\"\",INDEX($FH$3:$FH$14,SMALL(IF($FH$3:$FH$14<>\"\",ROW($FH$3:$FH$14)-2),ROWS($FH$3:FH3))))","v":"-"},"Brak (pełne)",{"$f":"IF(Wycena!$C$21=\"-\",\"-\",FJ3)","v":"-"},{"$f":"IF(ROWS($FK$3:FK3)>(ROWS($FK$3:$FK$14)-COUNTBLANK($FK$3:$FK$14)),\"\",INDEX($FK$3:$FK$14,SMALL(IF($FK$3:$FK$14<>\"\",ROW($FK$3:$FK$14)-2),ROWS($FK$3:FK3))))","v":"-"},null,4,"-","-",{"$f":"IF(ROWS($FP$3:FP3)>(ROWS($FP$3:$FP$23)-COUNTBLANK($FP$3:$FP$23)),\"\",INDEX($FP$3:$FP$23,SMALL(IF($FP$3:$FP$23<>\"\",ROW($FP$3:$FP$23)-2),ROWS($FP$3:FP3))))","v":"-"},"-",{"$f":"IF(ROWS($FR$3:FR3)>(ROWS($FR$3:$FR$23)-COUNTBLANK($FR$3:$FR$23)),\"\",INDEX($FR$3:$FR$23,SMALL(IF($FR$3:$FR$23<>\"\",ROW($FR$3:$FR$23)-2),ROWS($FR$3:FR3))))","v":"-"},"-",{"$f":"IF(ROWS($FT$3:FT3)>(ROWS($FT$3:$FT$23)-COUNTBLANK($FT$3:$FT$23)),\"\",INDEX($FT$3:$FT$23,SMALL(IF($FT$3:$FT$23<>\"\",ROW($FT$3:$FT$23)-2),ROWS($FT$3:FT3))))","v":"-"},null,"Brak (standard)",0,{"$f":"IFERROR(VLOOKUP(Wycena!C59,OFFSET(FW15,MATCH(Wycena!C59,FW15:FW39,0)-1,0,15,2),2,0),\"\")","v":"Ryglowy 3-punktowy z gałką (standard)"},{"$f":"IF(ROWS($FY$3:FY3)>(ROWS($FY$3:$FY$10)-COUNTBLANK($FY$3:$FY$10)),\"\",INDEX($FY$3:$FY$10,SMALL(IF($FY$3:$FY$10<>\"\",ROW($FY$3:$FY$10)-2),ROWS($FY$3:FY3))))","v":"Ryglowy 3-punktowy z gałką (standard)"},"Klamka Medos Warszawa (standard)",0,"Klamka Medos Warszawa (standard)",{"$f":"GC3","v":"Klamka Medos Warszawa (standard)"},null,null,null,null,null,{"$f":"IF((HLOOKUP(VLOOKUP(Wycena!$C$59,Mapping!$GI$35:$GJ$43,2,0),$GD$1:$GI$33,2+GK3))=0,\"\",(HLOOKUP(VLOOKUP(Wycena!$C$59,Mapping!$GI$35:$GJ$43,2,0),$GD$1:$GI$33,2+GK3)))","v":"Klamka Medos Warszawa (standard)"},1,{"$f":"IF(ROWS($GJ$3:GJ3)>(ROWS($GJ$3:$GJ$33)-COUNTBLANK($GJ$3:$GJ$33)),\"\",INDEX($GJ$3:$GJ$33,SMALL(IF($GJ$3:$GJ$33<>\"\",ROW($GJ$3:$GJ$33)-2),ROWS($GJ$3:GJ3))))","v":{"$error":"#N/A"}},"Klamka Medos Warszawa (standard)","Inox",{"$f":"IFERROR(VLOOKUP(Wycena!C61,OFFSET(GM2,MATCH(Wycena!C61,$GM$2:$GM$99,0)-1,0,100,2),2,0),\"\")","v":""},{"$f":"IF(ROWS($GO$3:GO3)>(ROWS($GO$3:$GO$6)-COUNTBLANK($GO$3:$GO$6)),\"\",INDEX($GO$3:$GO$6,SMALL(IF($GO$3:$GO$6<>\"\",ROW($GO$3:$GO$6)-2),ROWS($GO$3:GO3))))","v":""},{"$f":"IFERROR(IF(FIND(\"Antaba M\",Wycena!$C$61)>0,50,\"-\"),\"-\")","v":"-"},{"$f":"IF(ROWS($GQ$3:GQ3)>(ROWS($GQ$3:$GQ$9)-COUNTBLANK($GQ$3:$GQ$9)),\"\",INDEX($GQ$3:$GQ$9,SMALL(IF($GQ$3:$GQ$9<>\"\",ROW($GQ$3:$GQ$9)-2),ROWS($GQ$3:GQ3))))","v":"-"},"Standard satyna",0,{"$f":"IF(OR(Wycena!$C$59=Mapping!$FW$7,Wycena!$C$59=Mapping!$FW$6),\"\",GS3)","v":"Standard satyna"},{"$f":"IF(ROWS($GU$3:GU3)>(ROWS($GU$3:$GU$8)-COUNTBLANK($GU$3:$GU$8)),\"\",INDEX($GU$3:$GU$8,SMALL(IF($GU$3:$GU$8<>\"\",ROW($GU$3:$GU$8)-2),ROWS($GU$3:GU3))))","v":"Standard satyna"},"-",null,"-","-",{"$f":"IF(ROWS($GZ$3:GZ3)>(ROWS($GZ$3:$GZ$5)-COUNTBLANK(GZ$3:$GZ$5)),\"\",INDEX(GZ$3:$GZ$5,SMALL(IF(GZ$3:$GZ$5<>\"\",ROW(GZ$3:$GZ$5)-2),ROWS($GZ$3:GZ3))))","v":"-"},{"$f":"IF(Wycena!C59=Mapping!$HB$31,\"\",\"-\")","v":"-"},0,{"$f":"IF(ROWS($HB$3:HB3)>(ROWS($HJ$3:$HJ$4)-COUNTBLANK($HB$3:$HB$4)),\"\",INDEX($HB$3:$HB$4,SMALL(IF($HB$3:$HB$4<>\"\",ROW($HB$3:$HB$4)-2),ROWS($HB$3:HB3))))","v":"-"},null,null,null,null,null,{"$f":"IF(Wycena!$C$59=Mapping!$HB$31,\"\",\"-\")","v":"-"},{"$f":"IF(ROWS($HJ$3:HJ3)>(ROWS($HJ$3:$HJ$13)-COUNTBLANK($HJ$3:$HJ$13)),\"\",INDEX($HJ$3:$HJ$13,SMALL(IF($HJ$3:$HJ$13<>\"\",ROW($HJ$3:$HJ$13)-2),ROWS($HJ$3:HJ3))))","v":"-"},null,"Aluminiowy (standard)",0,0,"Aluminiowy (standard)",{"$f":"IF(ROWS($HP$3:HP3)>(ROWS($HP$3:$HP$5)-COUNTBLANK($HP$3:$HP$5)),\"\",INDEX($HP$3:$HP$5,SMALL(IF($HP$3:$HP$5<>\"\",ROW($HP$3:$HP$5)-2),ROWS($HP$3:HP3))))","v":"Aluminiowy (standard)"},null,"-",0,0,null,"-",0,0,0,0,"-",{"$f":"IF(ROWS($IB$3:IB3)>(ROWS($IB$3:$IB$9)-COUNTBLANK($IB$3:$IB$9)),\"\",INDEX($IB$3:$IB$9,SMALL(IF($IB$3:$IB$9<>\"\",ROW($IB$3:$IB$9)-2),ROWS($IB$3:IB3))))","v":"-"},null,"-",0,null,"-",0,null,"-",0,null,"-",0,null,"-",0,null,"-",0,null,0,null,100,null,0,null,"Inox","Inox",0,{"$f":"IF(ROWS($JD$3:JD3)>(ROWS($JD$3:$JD$4)-COUNTBLANK($JD$3:$JD$4)),\"\",INDEX($JD$3:$JD$4,SMALL(IF($JD$3:$JD$4<>\"\",ROW($JD$3:$JD$4)-2),ROWS($JD$3:JD3))))","v":"Inox"}]
["DB 03",20,20,20,20,34,34,{"$f":"F4+2","v":36},{"$f":"G4+2","v":36},"W ościeżnicy tradycyjna",4,null,{"$f":"IFERROR(VLOOKUP(Wycena!$C$5,OFFSET(SKU!$B$1,MATCH(Wycena!$C$5,SKU!$B$1:$B$743,0),0,1000,6),5,0),\"\")","v":""},{"$f":"IFERROR(VLOOKUP(Wycena!$C$5,OFFSET(SKU!$B$1,MATCH(Wycena!$C$5,SKU!$B$1:$B$743,0),0,1000,6),2,0)-VLOOKUP(Wycena!$C$5,SKU!$B$1:$C$743,2,0),\"\")","v":""},{"$f":"IF(ROWS($M$3:M4)>(ROWS($M$3:$M$10)-COUNTBLANK($M$3:$M$10)),\"\",INDEX($M$3:$M$10,SMALL(IF($M$3:$M$10<>\"\",ROW($M$3:$M$10)-2),ROWS($M$3:M4))))","v":""},null,"Dąb prosty poprzeczny",0,{"$f":"IF(VLOOKUP(Wycena!$C$5,SKU!$B$1:$D$743,3,0)=\"Płytowe\",Q4,\"\")","v":{"$error":"#N/A"}},{"$f":"IF(ROWS($S$3:S4)>(ROWS($S$3:$S$8)-COUNTBLANK($S$3:$S$8)),\"\",INDEX($S$3:$S$8,SMALL(IF($S$3:$S$8<>\"\",ROW($S$3:$S$8)-2),ROWS($S$3:S4))))","v":{"$error":"#N/A"}},null,"Dwukolor ościeżnica (standard)",0,null,"Brunat",0,{"$f":"Y4","v":"Brunat"},{"$f":"IF((VLOOKUP(Wycena!$C$7,Mapping!$Q$15:$R$20,2,0))=\"tak\",\"\",AA4)","v":"Brunat"},{"$f":"IF(ROWS($AB$3:AB4)>(ROWS($AB$3:$AB$229)-COUNTBLANK($AB$3:$AB$229)),\"\",INDEX($AB$3:$AB$229,SMALL(IF($AB$3:$AB$229<>\"\",ROW($AB$3:$AB$229)-2),ROWS($AB$3:AB4))))","v":{"$error":"#N/A"}},null,"-",null,{"$f":"IF(ROWS($AE$3:AE4)>(ROWS($AE$3:$AE$4)-COUNTBLANK($AE$3:$AE$4)),\"\",INDEX($AE$3:$AE$4,SMALL(IF($AE$3:$AE$4<>\"\",ROW($AE$3:$AE$4)-2),ROWS($AE$3:AE4))))","v":{"$error":"#N/A"}},null,{"$f":"IF(VLOOKUP(Wycena!$C$5,SKU!$B$1:$I$743,8,0)>0,\"Szary piasek\",\"\")","v":{"$error":"#N/A"}},{"$f":"VLOOKUP(Wycena!$C$5,SKU!$B$1:$I$743,8,0)","v":{"$error":"#N/A"}},{"$f":"IF(ROWS($AI$3:AI4)>(ROWS($AI$3:$AI$7)-COUNTBLANK($AI$3:$AI$7)),\"\",INDEX($AI$3:$AI$7,SMALL(IF($AI$3:$AI$7<>\"\",ROW($AI$3:$AI$7)-2),ROWS($AI$3:AI4))))","v":{"$error":"#N/A"}},null,"Bezprzylgowe",{"$f":"IF(VLOOKUP(Wycena!$C$5,SKU!$B$1:$D$743,3,0)=\"Płytowe\",AM4,\"\")","v":{"$error":"#N/A"}},{"$f":"IFERROR(IF(Wycena!C42*1>214,2800,2400),2400)*(IF(Wycena!C20=\"Imitacja skrzydła ruchoma\",1,0)+IF(Wycena!C21=\"Imitacja skrzydła ruchoma\",1,0)+1)","v":2400},{"$f":"IF(ROWS($AN$3:AN4)>(ROWS($AN$3:$AN$5)-COUNTBLANK($AN$3:$AN$5)),\"\",INDEX($AN$3:$AN$5,SMALL(IF($AN$3:$AN$5<>\"\",ROW($AN$3:$AN$5)-2),ROWS($AN$3:AN4))))","v":{"$error":"#N/A"}},null,90,{"$f":"IF(VLOOKUP(Wycena!$C$5,SKU!$B$1:$D$743,3,0)=\"Płytowe\",AR4,\"\")","v":{"$error":"#N/A"}},{"$f":"IF(OR((Wycena!C14=\"Bezprzylgowe\"),(Wycena!C14=\"Bezprzylgowe Glass\")),Mapping!AS4,\"\")","v":""},0,{"$f":"IF(ROWS($AT$3:AT4)>(ROWS($AT$3:$AT$5)-COUNTBLANK($AT$3:$AT$5)),\"\",INDEX($AT$3:$AT$5,SMALL(IF($AT$3:$AT$5<>\"\",ROW($AT$3:$AT$5)-2),ROWS($AT$3:AT4))))","v":""},null,73,0,0,{"$f":"IF(Wycena!$C$16=78,Mapping!AY4,AZ4)","v":0},1,"Konieczna dostawka",181,0,0,{"$f":"IF(Wycena!$C$16=78,Mapping!BE4,BF4)","v":0},1,"Konieczne naświetle",null,"Lewe do wewnątrz",{"$f":"IF(Wycena!$C$14=\"Bezprzylgowe Glass\",\"\",BK4)","v":"Lewe do wewnątrz"},{"$f":"IF(ROWS($BL$3:BL4)>(ROWS($BL$3:$BL$6)-COUNTBLANK($BL$3:$BL$6)),\"\",INDEX($BL$3:$BL$6,SMALL(IF($BL$3:$BL$6<>\"\",ROW($BL$3:$BL$6)-2),ROWS($BL$3:BL4))))","v":"Lewe do wewnątrz"},null,"W ościeżnicy nowoczesna","W ościeżnicy nowoczesna",{"$f":"BP4","v":"W ościeżnicy nowoczesna"},{"$f":"IF(Wycena!$C$14=\"Bezprzylgowe Glass\",\"\",BQ4)","v":"W ościeżnicy nowoczesna"},{"$f":"IF(ROWS($BR$3:BR4)>(ROWS($BR$3:$BR$8)-COUNTBLANK($BR$3:$BR$8)),\"\",INDEX($BR$3:$BR$8,SMALL(IF($BR$3:$BR$8<>\"\",ROW($BR$3:$BR$8)-2),ROWS($BR$3:BR4))))","v":{"$error":"#N/A"}},null,"W ościeżnicy",{"$f":"((1200+IF(Wycena!$F$9<>0,200,0))*(1+IFERROR(VLOOKUP(Wycena!$C$45,Mapping!$EZ$3:$FC$6,4,1),0)+IFERROR(VLOOKUP(Wycena!$C$49,Mapping!$EZ$3:$FC$6,4,1),0))*(1+VLOOKUP(Wycena!$C$54,Mapping!$BW$3:$BX$6,2,1)))","v":{"$error":"#N/A"}},50.000100000000003,0.2,{"$f":"IF(Wycena!$C$14=\"Bezprzylgowe Glass\",\"\",BU4)","v":"W ościeżnicy"},{"$f":"IF(ROWS($BY$3:BY4)>(ROWS($BY$3:$BY$6)-COUNTBLANK($BY$3:$BY$6)),\"\",INDEX($BY$3:$BY$6,SMALL(IF($BY$3:$BY$6<>\"\",ROW($BY$3:$BY$6)-2),ROWS($BY$3:BY4))))","v":"W ościeżnicy"},"Brąz refleks",0,{"$f":"CB4*(1+IFERROR(VLOOKUP(Wycena!$C$45,Mapping!$EZ$3:$FC$6,4,1),0)+IFERROR(VLOOKUP(Wycena!$C$49,Mapping!$EZ$3:$FC$6,4,1),0))*(1+VLOOKUP(Wycena!$C$54,Mapping!$BW$3:$BX$6,2,1))","v":{"$error":"#N/A"}},"Przezierne",{"$f":"IF(Wycena!$C$22=\"-\",\"\",CD4)","v":""},{"$f":"IF(ROWS($CE$3:CE4)>(ROWS($CE$3:$CE$13)-COUNTBLANK($CE$3:$CE$13)),\"\",INDEX($CE$3:$CE$13,SMALL(IF($CE$3:$CE$13<>\"\",ROW($CE$3:$CE$13)-2),ROWS($CE$3:CE4))))","v":""},null,null,null,"Krosnowa",300,{"$f":"IF(Wycena!$C$14=\"Przylgowe\",CJ4,\"\")","v":"Krosnowa"},{"$f":"IF(ROWS($CL$3:CL4)>(ROWS($CL$3:$CL$4)-COUNTBLANK($CL$3:$CL$4)),\"\",INDEX($CL$3:$CL$4,SMALL(IF($CL$3:$CL$4<>\"\",ROW($CL$3:$CL$4)-2),ROWS($CL$3:CL4))))","v":"Krosnowa"},null,"Przy skrzydle od zewnątrz",1200,{"$f":"IF(Wycena!$C$25=\"Krosnowa\",\"\",CO4)","v":"Przy skrzydle od zewnątrz"},{"$f":"IF(Wycena!$C$14=\"Bezprzylgowe Glass\",\"\",CQ4)","v":"Przy skrzydle od zewnątrz"},{"$f":"CR4","v":"Przy skrzydle od zewnątrz"},{"$f":"CS4","v":"Przy skrzydle od zewnątrz"},{"$f":"IF(ROWS($CT$3:CT4)>(ROWS($CT$3:$CT$11)-COUNTBLANK($CT$3:$CT$11)),\"\",INDEX($CT$3:$CT$11,SMALL(IF($CT$3:$CT$11<>\"\",ROW($CT$3:$CT$11)-2),ROWS($CT$3:CT4))))","v":"Przy skrzydle od zewnątrz"},null,"krosnowa",10.5,"Bezprzylgowe",8,7,{"$f":"IF(DA4>=VLOOKUP(Wycena!$C$14,Mapping!$CY$3:$CZ$5,2,0),DA4,\"\")","v":7},{"$f":"IF(ROWS($DB$3:DB4)>(ROWS($DB$3:$DB$28)-COUNTBLANK($DB$3:$DB$28)),\"\",INDEX($DB$3:$DB$28,SMALL(IF($DB$3:$DB$28<>\"\",ROW($DB$3:$DB$28)-2),ROWS($DB$3:DB4))))","v":7},null,"krosnowa",10.5,"Bezprzylgowe",{"$f":"IF(OR(Wycena!$C$20=\"-\",Wycena!$C$20=\"Imitacja skrzydła ruchoma\"),(MAX((IFERROR(VLOOKUP(Wycena!C5,Mapping!$DG$21:$DH$23,2,0),0)),(8+VLOOKUP(Wycena!C26,$CO$16:$CS$25,IF(AND(Wycena!C20=\"-\",Wycena!C21=\"-\"),2,IF(AND(Wycena!C20<>\"-\",Wycena!C21=\"-\"),3,IF(AND(Wycena!C20=\"-\",Wycena!C21<>\"-\"),4,5))),0)))),(8+VLOOKUP(Wycena!C26,$CO$16:$CS$25,IF(AND(Wycena!C20=\"-\",Wycena!C21=\"-\"),2,IF(AND(Wycena!C20<>\"-\",Wycena!C21=\"-\"),3,IF(AND(Wycena!C20=\"-\",Wycena!C21<>\"-\"),4,5))),0)))","v":8},{"$f":"IF(Wycena!$C$21=\"Imitacja skrzydła ruchoma\",(MAX((IFERROR(VLOOKUP(Wycena!C5,Mapping!$DG$21:$DH$23,2,0),0)),(8+VLOOKUP(Wycena!C26,$CO$28:$CS$37,IF(AND(Wycena!C20=\"-\",Wycena!C21=\"-\"),2,IF(AND(Wycena!C20<>\"-\",Wycena!C21=\"-\"),3,IF(AND(Wycena!C20=\"-\",Wycena!C21<>\"-\"),4,5))),0)))),(8+VLOOKUP(Wycena!C26,$CO$28:$CS$37,IF(AND(Wycena!C20=\"-\",Wycena!C21=\"-\"),2,IF(AND(Wycena!C20<>\"-\",Wycena!C21=\"-\"),3,IF(AND(Wycena!C20=\"-\",Wycena!C21<>\"-\"),4,5))),0)))","v":8},null,7,{"$f":"IF(DK4>=VLOOKUP(Wycena!$C$14,Mapping!$DG$3:$DH$5,2,0),DK4,\"\")","v":7},{"$f":"IF(ROWS($DL$3:DL4)>(ROWS($DL$3:$DL$28)-COUNTBLANK($DL$3:$DL$28)),\"\",INDEX($DL$3:$DL$28,SMALL(IF($DL$3:$DL$28<>\"\",ROW($DL$3:$DL$28)-2),ROWS($DL$3:DL4))))","v":7},{"$f":"IF(DK4>=VLOOKUP(Wycena!$C$14,Mapping!$DG$3:$DI$5,3,0),DK4,\"\")","v":7},{"$f":"IF(ROWS($DN$3:DN4)>(ROWS($DN$3:$DN$28)-COUNTBLANK($DN$3:$DN$28)),\"\",INDEX($DN$3:$DN$28,SMALL(IF($DN$3:$DN$28<>\"\",ROW($DN$3:$DN$28)-2),ROWS($DN$3:DN4))))","v":7},null,"krosnowa",6,7,{"$f":"IF(DS4>=VLOOKUP(Wycena!$C$25,Mapping!$DQ$3:$DR$4,2,0),DS4,\"\")","v":""},{"$f":"IF(ROWS($DT$3:DT4)>(ROWS($DT$3:$DT$28)-COUNTBLANK($DT$3:$DT$28)),\"\",INDEX($DT$3:$DT$28,SMALL(IF($DT$3:$DT$28<>\"\",ROW($DT$3:$DT$28)-2),ROWS($DT$3:DT4))))","v":11},null,1,null,"Tak",{"$f":"340+(IF(Wycena!C20<>\"-\",1,0)+IF(Wycena!C21<>\"-\",1,0))*DZ8+IF((IF(Wycena!C16=\"-\",212,IF(Wycena!C16=78, 212,214)))<Wycena!$C$18,1,0)*DZ9","v":340},null,"Tak",{"$f":"380+(IF(Wycena!C20<>\"-\",1,0)+IF(Wycena!C21<>\"-\",1,0))*EC8+IF((IF(Wycena!C16=\"-\",212,IF(Wycena!C16=78, 212,214)))<Wycena!$C$18,1,0)*EC9","v":380},{"$f":"IF(Wycena!C14=\"Bezprzylgowe Glass\",\"\",EB4)","v":"Tak"},{"$f":"IF(ROWS($ED$3:ED4)>(ROWS($ED$3:$ED$4)-COUNTBLANK($ED$3:$ED$4)),\"\",INDEX($ED$3:$ED$4,SMALL(IF($ED$3:$ED$4<>\"\",ROW($ED$3:$ED$4)-2),ROWS($ED$3:ED4))))","v":"Tak"},null,"1 kpl",{"$f":"300+(IF(Wycena!C20<>\"-\",1,0)+IF(Wycena!C21<>\"-\",1,0))*EH8+IF((IF(Wycena!C16=\"-\",212,IF(Wycena!C16=78, 212,214)))<Wycena!$C$18,1,0)*EH9","v":300},null,"1 kpl",{"$f":"140+(IF(Wycena!C20<>\"-\",1,0)+IF(Wycena!C21<>\"-\",1,0))*EK8+IF((IF(Wycena!C16=\"-\",212,IF(Wycena!C16=78, 212,214)))<Wycena!$C$18,1,0)*EK9","v":140},null,85,null,null,{"$f":"IF(OR(Wycena!$C$20<>\"-\",Wycena!$C$21<>\"-\",),EM4,\"\")","v":""},{"$f":"IF(ROWS($EP$3:EP4)>(ROWS($EP$3:$EP$8)-COUNTBLANK($EP$3:$EP$8)),\"\",INDEX($EP$3:$EP$8,SMALL(IF($EP$3:$EP$8<>\"\",ROW($EP$3:$EP$8)-2),ROWS($EP$3:EP4))))","v":""},null,206,206.001,0.1,{"$f":"IF(IF(Wycena!$C$22<>\"-\",ES4,\"\")<=Wycena!$C$18-Wycena!$C$27,ES4,\"\")","v":""},{"$f":"IF(ROWS($EV$3:EV4)>(ROWS($EV$3:$EV$8)-COUNTBLANK($EV$3:$EV$8)),\"\",INDEX($EV$3:$EV$8,SMALL(IF($EV$3:$EV$8<>\"\",ROW($EV$3:$EV$8)-2),ROWS($EV$3:EV4))))","v":""},null,50,50.000999999999998,{"$f":"70%+IF(Wycena!$C$20=\"Imitacja skrzydła ruchoma\",0.1,0)","v":0.7},{"$f":"70%+IF(Wycena!$C$21=\"Imitacja skrzydła ruchoma\",0.1,0)","v":0.7},0.7,{"$f":"IFERROR(VLOOKUP(Wycena!$C$45,Mapping!$EZ$3:$FC$6,4,1)+VLOOKUP(Wycena!$C$49,Mapping!$EZ$3:$FC$6,4,1),0)","v":0},"Przezierne",200,"Przezierne",{"$f":"IF(Wycena!$C$20=\"-\",\"-\",FG4)","v":"-"},{"$f":"IF(ROWS($FH$3:FH4)>(ROWS($FH$3:$FH$14)-COUNTBLANK($FH$3:$FH$14)),\"\",INDEX($FH$3:$FH$14,SMALL(IF($FH$3:$FH$14<>\"\",ROW($FH$3:$FH$14)-2),ROWS($FH$3:FH4))))","v":"-"},"Przezierne",{"$f":"IF(Wycena!$C$21=\"-\",\"\",FJ4)","v":""},{"$f":"IF(ROWS($FK$3:FK4)>(ROWS($FK$3:$FK$14)-COUNTBLANK($FK$3:$FK$14)),\"\",INDEX($FK$3:$FK$14,SMALL(IF($FK$3:$FK$14<>\"\",ROW($FK$3:$FK$14)-2),ROWS($FK$3:FK4))))","v":""},null,null,1,{"$f":"IF(Wycena!$C$20=\"-\",\"\",FO4)","v":""},{"$f":"IF(ROWS($FP$3:FP4)>(ROWS($FP$3:$FP$23)-COUNTBLANK($FP$3:$FP$23)),\"\",INDEX($FP$3:$FP$23,SMALL(IF($FP$3:$FP$23<>\"\",ROW($FP$3:$FP$23)-2),ROWS($FP$3:FP4))))","v":""},{"$f":"IF(Wycena!$C$21=\"-\",\"\",FO4)","v":""},{"$f":"IF(ROWS($FR$3:FR4)>(ROWS($FR$3:$FR$23)-COUNTBLANK($FR$3:$FR$23)),\"\",INDEX($FR$3:$FR$23,SMALL(IF($FR$3:$FR$23<>\"\",ROW($FR$3:$FR$23)-2),ROWS($FR$3:FR4))))","v":""},{"$f":"IF(Wycena!$C$22=\"-\",\"\",FO4)","v":""},{"$f":"IF(ROWS($FT$3:FT4)>(ROWS($FT$3:$FT$23)-COUNTBLANK($FT$3:$FT$23)),\"\",INDEX($FT$3:$FT$23,SMALL(IF($FT$3:$FT$23<>\"\",ROW($FT$3:$FT$23)-2),ROWS($FT$3:FT4))))","v":""},null,"Zestaw elektronik z zamkiem ryglowym",1000,{"$f":"IFERROR(VLOOKUP(Wycena!C59,OFFSET(FW15,MATCH(Wycena!C59,FW15:FW39,0),0,15,2),2,0),\"\")","v":"Ryglowy 3-punktowy bez gałki (standard)"},{"$f":"IF(ROWS($FY$3:FY4)>(ROWS($FY$3:$FY$10)-COUNTBLANK($FY$3:$FY$10)),\"\",INDEX($FY$3:$FY$10,SMALL(IF($FY$3:$FY$10<>\"\",ROW($FY$3:$FY$10)-2),ROWS($FY$3:FY4))))","v":"Ryglowy 3-punktowy bez gałki (standard)"},"Klamka Medos Dublin",250,"Klamka Medos Dublin",{"$f":"GC4","v":"Klamka Medos Dublin"},null,null,null,null,null,{"$f":"IF((HLOOKUP(VLOOKUP(Wycena!$C$59,Mapping!$GI$35:$GJ$43,2,0),$GD$1:$GI$33,2+GK4))=0,\"\",(HLOOKUP(VLOOKUP(Wycena!$C$59,Mapping!$GI$35:$GJ$43,2,0),$GD$1:$GI$33,2+GK4)))","v":"Klamka Medos Dublin"},2,{"$f":"IF(ROWS($GJ$3:GJ4)>(ROWS($GJ$3:$GJ$33)-COUNTBLANK($GJ$3:$GJ$33)),\"\",INDEX($GJ$3:$GJ$33,SMALL(IF($GJ$3:$GJ$33<>\"\",ROW($GJ$3:$GJ$33)-2),ROWS($GJ$3:GJ4))))","v":{"$error":"#N/A"}},"Klamka Medos Warszawa (standard)","Stare złoto",{"$f":"IFERROR(VLOOKUP(Wycena!C61,OFFSET(GM2,MATCH(Wycena!C61,$GM$2:$GM$98,0),0,100,2),2,0),\"\")","v":""},{"$f":"IF(ROWS($GO$3:GO4)>(ROWS($GO$3:$GO$6)-COUNTBLANK($GO$3:$GO$6)),\"\",INDEX($GO$3:$GO$6,SMALL(IF($GO$3:$GO$6<>\"\",ROW($GO$3:$GO$6)-2),ROWS($GO$3:GO4))))","v":""},{"$f":"IFERROR(IF(FIND(\"Antaba M\",Wycena!$C$61)>0,80,\"\"),\"\")","v":""},{"$f":"IF(ROWS($GQ$3:GQ4)>(ROWS($GQ$3:$GQ$9)-COUNTBLANK($GQ$3:$GQ$9)),\"\",INDEX($GQ$3:$GQ$9,SMALL(IF($GQ$3:$GQ$9<>\"\",ROW($GQ$3:$GQ$9)-2),ROWS($GQ$3:GQ4))))","v":""},"Standard patyna",0,{"$f":"IF(OR(Wycena!$C$59=Mapping!$FW$7,Wycena!$C$59=Mapping!$FW$6),\"\",GS4)","v":"Standard patyna"},{"$f":"IF(ROWS($GU$3:GU4)>(ROWS($GU$3:$GU$8)-COUNTBLANK($GU$3:$GU$8)),\"\",INDEX($GU$3:$GU$8,SMALL(IF($GU$3:$GU$8<>\"\",ROW($GU$3:$GU$8)-2),ROWS($GU$3:GU4))))","v":"Standard patyna"},"Manualna",350,{"$f":"IF(Wycena!$C$59=Mapping!$GW$15,Mapping!GW4,\"\")","v":"Manualna"},{"$f":"IFERROR(IF(FIND(\"Klamka\",Wycena!$C$61)>0,\"\",GY4),GY4)","v":"Manualna"},{"$f":"IF(ROWS($GZ$3:GZ4)>(ROWS($GZ$3:$GZ$5)-COUNTBLANK(GZ$3:$GZ$5)),\"\",INDEX(GZ$3:$GZ$5,SMALL(IF(GZ$3:$GZ$5<>\"\",ROW(GZ$3:$GZ$5)-2),ROWS($GZ$3:GZ4))))","v":"Manualna"},"Tak",{"$f":"300-IF(Wycena!C59=Mapping!FY31,300,0)","v":300},{"$f":"IF(ROWS($HB$3:HB4)>(ROWS($HB$3:$HB$4)-COUNTBLANK($HB$3:$HB$4)),\"\",INDEX($HB$3:$HB$4,SMALL(IF($HB$3:$HB$4<>\"\",ROW($HB$3:$HB$4)-2),ROWS($HB$3:HB4))))","v":"Tak"},null,"W skrzydle",400,{"$f":"IF(Wycena!$C$59=Mapping!$HB$31,-400,0)+HG4","v":400},{"$f":"IF(Wycena!$C$6=\"Brak (pełne)\",\"\",HF4)","v":"W skrzydle"},{"$f":"HI4","v":"W skrzydle"},{"$f":"IF(ROWS($HJ$3:HJ4)>(ROWS($HJ$3:$HJ$13)-COUNTBLANK($HJ$3:$HJ$13)),\"\",INDEX($HJ$3:$HJ$13,SMALL(IF($HJ$3:$HJ$13<>\"\",ROW($HJ$3:$HJ$13)-2),ROWS($HJ$3:HJ4))))","v":"W skrzydle"},null,"Drewniany z nakładką aluminową",200,{"$f":"(1+IFERROR(VLOOKUP(Wycena!$C$45,Mapping!$EZ$3:$FC$6,4,1),0)+IFERROR(VLOOKUP(Wycena!$C$49,Mapping!$EZ$3:$FC$6,4,1),0))*HN4","v":200},"Drewniany z nakładką aluminową",{"$f":"IF(ROWS($HP$3:HP4)>(ROWS($HP$3:$HP$5)-COUNTBLANK($HP$3:$HP$5)),\"\",INDEX($HP$3:$HP$5,SMALL(IF($HP$3:$HP$5<>\"\",ROW($HP$3:$HP$5)-2),ROWS($HP$3:HP4))))","v":"Drewniany z nakładką aluminową"},null,3,60,{"$f":"(1+IFERROR(VLOOKUP(Wycena!$C$45,Mapping!$EZ$3:$FC$6,4,1),0)+IFERROR(VLOOKUP(Wycena!$C$49,Mapping!$EZ$3:$FC$6,4,1),0))*HT4","v":60},null,"Z jednej strony skrzydła",100,100,200,200,"Z jednej strony skrzydła",{"$f":"IF(ROWS($IB$3:IB4)>(ROWS($IB$3:$IB$9)-COUNTBLANK($IB$3:$IB$9)),\"\",INDEX($IB$3:$IB$9,SMALL(IF($IB$3:$IB$9<>\"\",ROW($IB$3:$IB$9)-2),ROWS($IB$3:IB4))))","v":"Z jednej strony skrzydła"},null,"Inox",150,null,"Nawierzchniowy inox",350,null,"Lew retro patyna",400,null,"Na skrzydle",200,null,"Tak",50,null,"Tak",120,null,0.01,null,200,null,0.08,null,"Czarny",{"$f":"IF(Wycena!C14=Mapping!JC6,\"\",Mapping!JC4)","v":""},{"$f":"IF(JD4=JD6,0,IFERROR(IF(Wycena!C42*1>214,400,350),350))","v":350},{"$f":"IF(ROWS($JD$3:JD4)>(ROWS($JD$3:$JD$4)-COUNTBLANK($JD$3:$JD$4)),\"\",INDEX($JD$3:$JD$4,SMALL(IF($JD$3:$JD$4<>\"\",ROW($JD$3:$JD$4)-2),ROWS($JD$3:JD4))))","v":""}]
["DB 04",20,20,20,20,34,34,36,36,"W ościeżnicy kasetonem",4,null,{"$f":"IFERROR(VLOOKUP(Wycena!$C$5,OFFSET(SKU!$B$1,MATCH(Wycena!$C$5,SKU!$B$1:$B$743,0)+1,0,1000,6),5,0),\"\")","v":""},{"$f":"IFERROR(VLOOKUP(Wycena!$C$5,OFFSET(SKU!$B$1,MATCH(Wycena!$C$5,SKU!$B$1:$B$743,0)+1,0,1000,6),2,0)-VLOOKUP(Wycena!$C$5,SKU!$B$1:$C$743,2,0),\"\")","v":""},{"$f":"IF(ROWS($M$3:M5)>(ROWS($M$3:$M$10)-COUNTBLANK($M$3:$M$10)),\"\",INDEX($M$3:$M$10,SMALL(IF($M$3:$M$10<>\"\",ROW($M$3:$M$10)-2),ROWS($M$3:M5))))","v":""},null,"Dab flader podłużny",900,{"$f":"IF(VLOOKUP(Wycena!$C$5,SKU!$B$1:$D$743,3,0)=\"Płytowe\",Q5,\"\")","v":{"$error":"#N/A"}},{"$f":"IF(ROWS($S$3:S5)>(ROWS($S$3:$S$8)-COUNTBLANK($S$3:$S$8)),\"\",INDEX($S$3:$S$8,SMALL(IF($S$3:$S$8<>\"\",ROW($S$3:$S$8)-2),ROWS($S$3:S5))))","v":{"$error":"#N/A"}},null,"Dwukolor",300,null,"Dąb",0,"Dąb",{"$f":"AA5","v":"Dąb"},{"$f":"IF(ROWS($AB$3:AB5)>(ROWS($AB$3:$AB$229)-COUNTBLANK($AB$3:$AB$229)),\"\",INDEX($AB$3:$AB$229,SMALL(IF($AB$3:$AB$229<>\"\",ROW($AB$3:$AB$229)-2),ROWS($AB$3:AB5))))","v":{"$error":"#N/A"}},null,"x",null,"x",null,{"$f":"IF(VLOOKUP(Wycena!$C$5,SKU!$B$1:$I$743,8,0)>0,\"Skała beżowa\",\"\")","v":{"$error":"#N/A"}},{"$f":"VLOOKUP(Wycena!$C$5,SKU!$B$1:$I$743,8,0)","v":{"$error":"#N/A"}},{"$f":"IF(ROWS($AI$3:AI5)>(ROWS($AI$3:$AI$7)-COUNTBLANK($AI$3:$AI$7)),\"\",INDEX($AI$3:$AI$7,SMALL(IF($AI$3:$AI$7<>\"\",ROW($AI$3:$AI$7)-2),ROWS($AI$3:AI5))))","v":{"$error":"#N/A"}},null,"Bezprzylgowe Glass",{"$f":"IF(OR((VLOOKUP(Wycena!$C$5,SKU!$B$1:$E$743,4,0)=\"Simple\"),VLOOKUP(Wycena!$C$5,SKU!$B$1:$E$743,4,0)=\"Prestige Glass\",VLOOKUP(Wycena!$C$5,SKU!$B$1:$E$743,4,0)=\"Maverick\"),AM5,\"\")","v":{"$error":"#N/A"}},{"$f":"IFERROR(IF(Wycena!C42*1>214,2800,2400),2400)","v":2400},{"$f":"IF(ROWS($AN$3:AN5)>(ROWS($AN$3:$AN$5)-COUNTBLANK($AN$3:$AN$5)),\"\",INDEX($AN$3:$AN$5,SMALL(IF($AN$3:$AN$5<>\"\",ROW($AN$3:$AN$5)-2),ROWS($AN$3:AN5))))","v":{"$error":"#N/A"}},null,null,null,null,null,{"$f":"IF(ROWS($AT$3:AT5)>(ROWS($AT$3:$AT$5)-COUNTBLANK($AT$3:$AT$5)),\"\",INDEX($AT$3:$AT$5,SMALL(IF($AT$3:$AT$5<>\"\",ROW($AT$3:$AT$5)-2),ROWS($AT$3:AT5))))","v":""},null,74,0,0,{"$f":"IF(Wycena!$C$16=78,Mapping!AY5,AZ5)","v":0},2,"Konieczne 2 dostawki",182,0,0,{"$f":"IF(Wycena!$C$16=78,Mapping!BE5,BF5)","v":0},null,null,null,"Prawe na zewnątrz","Prawe na zewnątrz",{"$f":"IF(ROWS($BL$3:BL5)>(ROWS($BL$3:$BL$6)-COUNTBLANK($BL$3:$BL$6)),\"\",INDEX($BL$3:$BL$6,SMALL(IF($BL$3:$BL$6<>\"\",ROW($BL$3:$BL$6)-2),ROWS($BL$3:BL5))))","v":"Prawe na zewnątrz"},null,"W ościeżnicy tradycyjna",{"$f":"IF(VLOOKUP(Wycena!$C$5,SKU!$B$1:$D$743,3,0)=\"Płytowe\",\"\",BO5)","v":{"$error":"#N/A"}},{"$f":"BP5","v":{"$error":"#N/A"}},{"$f":"IF(Wycena!$C$14=\"Bezprzylgowe Glass\",\"\",BQ5)","v":{"$error":"#N/A"}},{"$f":"IF(ROWS($BR$3:BR5)>(ROWS($BR$3:$BR$8)-COUNTBLANK($BR$3:$BR$8)),\"\",INDEX($BR$3:$BR$8,SMALL(IF($BR$3:$BR$8<>\"\",ROW($BR$3:$BR$8)-2),ROWS($BR$3:BR5))))","v":{"$error":"#N/A"}},null,"Imitacja skrzydła",{"$f":"((1200+IF(Wycena!$F$9<>0,200,0))*(1+IFERROR(VLOOKUP(Wycena!$C$45,Mapping!$EZ$3:$FC$6,4,1),0)+IFERROR(VLOOKUP(Wycena!$C$49,Mapping!$EZ$3:$FC$6,4,1),0))*(1+VLOOKUP(Wycena!$C$54,Mapping!$BW$3:$BX$6,2,1)))","v":{"$error":"#N/A"}},70.000100000000003,0.5,{"$f":"IF(Wycena!$C$14=\"Bezprzylgowe Glass\",\"\",BU5)","v":"Imitacja skrzydła"},{"$f":"IF(ROWS($BY$3:BY5)>(ROWS($BY$3:$BY$6)-COUNTBLANK($BY$3:$BY$6)),\"\",INDEX($BY$3:$BY$6,SMALL(IF($BY$3:$BY$6<>\"\",ROW($BY$3:$BY$6)-2),ROWS($BY$3:BY5))))","v":"Imitacja skrzydła"},"Grafit refleks",50,{"$f":"CB5*(1+IFERROR(VLOOKUP(Wycena!$C$45,Mapping!$EZ$3:$FC$6,4,1),0)+IFERROR(VLOOKUP(Wycena!$C$49,Mapping!$EZ$3:$FC$6,4,1),0))*(1+VLOOKUP(Wycena!$C$54,Mapping!$BW$3:$BX$6,2,1))","v":{"$error":"#N/A"}},"Brąz refleks",{"$f":"IF(Wycena!$C$22=\"-\",\"\",CD5)","v":""},{"$f":"IF(ROWS($CE$3:CE5)>(ROWS($CE$3:$CE$13)-COUNTBLANK($CE$3:$CE$13)),\"\",INDEX($CE$3:$CE$13,SMALL(IF($CE$3:$CE$13<>\"\",ROW($CE$3:$CE$13)-2),ROWS($CE$3:CE5))))","v":""},null,null,null,"x","x","x","x",null,"Przy skrzydle z dwóch stron",1600,{"$f":"IF(Wycena!$C$25=\"Krosnowa\",\"\",CO5)","v":"Przy skrzydle z dwóch stron"},{"$f":"IF(Wycena!$C$14=\"Bezprzylgowe Glass\",\"\",CQ5)","v":"Przy skrzydle z dwóch stron"},{"$f":"CR5","v":"Przy skrzydle z dwóch stron"},{"$f":"CS5","v":"Przy skrzydle z dwóch stron"},{"$f":"IF(ROWS($CT$3:CT5)>(ROWS($CT$3:$CT$11)-COUNTBLANK($CT$3:$CT$11)),\"\",INDEX($CT$3:$CT$11,SMALL(IF($CT$3:$CT$11<>\"\",ROW($CT$3:$CT$11)-2),ROWS($CT$3:CT5))))","v":"Przy skrzydle z dwóch stron"},null,null,null,"Bezprzylgowe Glass",12,8,{"$f":"IF(DA5>=VLOOKUP(Wycena!$C$14,Mapping!$CY$3:$CZ$5,2,0),DA5,\"\")","v":8},{"$f":"IF(ROWS($DB$3:DB5)>(ROWS($DB$3:$DB$28)-COUNTBLANK($DB$3:$DB$28)),\"\",INDEX($DB$3:$DB$28,SMALL(IF($DB$3:$DB$28<>\"\",ROW($DB$3:$DB$28)-2),ROWS($DB$3:DB5))))","v":8},null,null,null,"Bezprzylgowe Glass",12,12,null,8,{"$f":"IF(DK5>=VLOOKUP(Wycena!$C$14,Mapping!$DG$3:$DH$5,2,0),DK5,\"\")","v":8},{"$f":"IF(ROWS($DL$3:DL5)>(ROWS($DL$3:$DL$28)-COUNTBLANK($DL$3:$DL$28)),\"\",INDEX($DL$3:$DL$28,SMALL(IF($DL$3:$DL$28<>\"\",ROW($DL$3:$DL$28)-2),ROWS($DL$3:DL5))))","v":8},{"$f":"IF(DK5>=VLOOKUP(Wycena!$C$14,Mapping!$DG$3:$DI$5,3,0),DK5,\"\")","v":8},{"$f":"IF(ROWS($DN$3:DN5)>(ROWS($DN$3:$DN$28)-COUNTBLANK($DN$3:$DN$28)),\"\",INDEX($DN$3:$DN$28,SMALL(IF($DN$3:$DN$28<>\"\",ROW($DN$3:$DN$28)-2),ROWS($DN$3:DN5))))","v":8},null,null,null,8,{"$f":"IF(DS5>=VLOOKUP(Wycena!$C$25,Mapping!$DQ$3:$DR$4,2,0),DS5,\"\")","v":""},{"$f":"IF(ROWS($DT$3:DT5)>(ROWS($DT$3:$DT$28)-COUNTBLANK($DT$3:$DT$28)),\"\",INDEX($DT$3:$DT$28,SMALL(IF($DT$3:$DT$28<>\"\",ROW($DT$3:$DT$28)-2),ROWS($DT$3:DT5))))","v":12},null,2,null,null,null,null,null,null,"x","x",null,"2 kpl",{"$f":"600+((IF(Wycena!C20<>\"-\",1,0)+IF(Wycena!C21<>\"-\",1,0))*EH8+IF((IF(Wycena!C16=\"-\",212,IF(Wycena!C16=78, 212,214)))<Wycena!$C$18,1,0)*EH9*2)","v":600},null,"2 kpl",{"$f":"280+((IF(Wycena!C20<>\"-\",1,0)+IF(Wycena!C21<>\"-\",1,0))*EK8+IF((IF(Wycena!C16=\"-\",212,IF(Wycena!C16=78, 212,214)))<Wycena!$C$18,1,0)*EK9*2)","v":280},null,90,90.001000000000005,300,{"$f":"IF(OR(Wycena!$C$20<>\"-\",Wycena!$C$21<>\"-\",),EM5,\"\")","v":""},{"$f":"IF(ROWS($EP$3:EP5)>(ROWS($EP$3:$EP$8)-COUNTBLANK($EP$3:$EP$8)),\"\",INDEX($EP$3:$EP$8,SMALL(IF($EP$3:$EP$8<>\"\",ROW($EP$3:$EP$8)-2),ROWS($EP$3:EP5))))","v":""},null,214,214.001,0.2,{"$f":"IF(IF(Wycena!$C$22<>\"-\",ES5,\"\")<=Wycena!$C$18-Wycena!$C$27,ES5,\"\")","v":""},{"$f":"IF(ROWS($EV$3:EV5)>(ROWS($EV$3:$EV$8)-COUNTBLANK($EV$3:$EV$8)),\"\",INDEX($EV$3:$EV$8,SMALL(IF($EV$3:$EV$8<>\"\",ROW($EV$3:$EV$8)-2),ROWS($EV$3:EV5))))","v":""},null,70,70.001000000000005,{"$f":"100%+IF(Wycena!$C$20=\"Imitacja skrzydła ruchoma\",0.1,0)","v":1},{"$f":"100%+IF(Wycena!$C$21=\"Imitacja skrzydła ruchoma\",0.1,0)","v":1},1,{"$f":"IFERROR(VLOOKUP(Wycena!$C$45,Mapping!$EZ$3:$FC$6,4,1)+VLOOKUP(Wycena!$C$49,Mapping!$EZ$3:$FC$6,4,1),0)","v":0},"Brąz refleks",200,"Brąz refleks",{"$f":"IF(Wycena!$C$20=\"-\",\"\",FG5)","v":""},{"$f":"IF(ROWS($FH$3:FH5)>(ROWS($FH$3:$FH$14)-COUNTBLANK($FH$3:$FH$14)),\"\",INDEX($FH$3:$FH$14,SMALL(IF($FH$3:$FH$14<>\"\",ROW($FH$3:$FH$14)-2),ROWS($FH$3:FH5))))","v":""},"Brąz refleks",{"$f":"IF(Wycena!$C$21=\"-\",\"\",FJ5)","v":""},{"$f":"IF(ROWS($FK$3:FK5)>(ROWS($FK$3:$FK$14)-COUNTBLANK($FK$3:$FK$14)),\"\",INDEX($FK$3:$FK$14,SMALL(IF($FK$3:$FK$14<>\"\",ROW($FK$3:$FK$14)-2),ROWS($FK$3:FK5))))","v":""},null,"stawka powyżej 4",2,{"$f":"IF(Wycena!$C$20=\"-\",\"\",FO5)","v":""},{"$f":"IF(ROWS($FP$3:FP5)>(ROWS($FP$3:$FP$23)-COUNTBLANK($FP$3:$FP$23)),\"\",INDEX($FP$3:$FP$23,SMALL(IF($FP$3:$FP$23<>\"\",ROW($FP$3:$FP$23)-2),ROWS($FP$3:FP5))))","v":""},{"$f":"IF(Wycena!$C$21=\"-\",\"\",FO5)","v":""},{"$f":"IF(ROWS($FR$3:FR5)>(ROWS($FR$3:$FR$23)-COUNTBLANK($FR$3:$FR$23)),\"\",INDEX($FR$3:$FR$23,SMALL(IF($FR$3:$FR$23<>\"\",ROW($FR$3:$FR$23)-2),ROWS($FR$3:FR5))))","v":""},{"$f":"IF(Wycena!$C$22=\"-\",\"\",FO5)","v":""},{"$f":"IF(ROWS($FT$3:FT5)>(ROWS($FT$3:$FT$23)-COUNTBLANK($FT$3:$FT$23)),\"\",INDEX($FT$3:$FT$23,SMALL(IF($FT$3:$FT$23<>\"\",ROW($FT$3:$FT$23)-2),ROWS($FT$3:FT5))))","v":""},null,"Zestaw elektronik z zamkiem automatycznym",1300,{"$f":"IFERROR(VLOOKUP(Wycena!C59,OFFSET(FW15,MATCH(Wycena!C59,FW15:FW40,0)+1,0,15,2),2,0),\"\")","v":"Ryglowy 4-punktowy"},{"$f":"IF(ROWS($FY$3:FY5)>(ROWS($FY$3:$FY$10)-COUNTBLANK($FY$3:$FY$10)),\"\",INDEX($FY$3:$FY$10,SMALL(IF($FY$3:$FY$10<>\"\",ROW($FY$3:$FY$10)-2),ROWS($FY$3:FY5))))","v":"Ryglowy 4-punktowy"},"Klamka Barański Retro",600,"Klamka Barański Retro","Klamka Barański Retro",null,null,null,null,null,{"$f":"IF((HLOOKUP(VLOOKUP(Wycena!$C$59,Mapping!$GI$35:$GJ$43,2,0),$GD$1:$GI$33,2+GK5))=0,\"\",(HLOOKUP(VLOOKUP(Wycena!$C$59,Mapping!$GI$35:$GJ$43,2,0),$GD$1:$GI$33,2+GK5)))","v":"Klamka Barański Retro"},3,{"$f":"IF(ROWS($GJ$3:GJ5)>(ROWS($GJ$3:$GJ$33)-COUNTBLANK($GJ$3:$GJ$33)),\"\",INDEX($GJ$3:$GJ$33,SMALL(IF($GJ$3:$GJ$33<>\"\",ROW($GJ$3:$GJ$33)-2),ROWS($GJ$3:GJ5))))","v":{"$error":"#N/A"}},"Klamka Medos Warszawa (standard)","Czarny",{"$f":"IFERROR(VLOOKUP(Wycena!C61,OFFSET(GM2,MATCH(Wycena!C61,$GM$2:$GM$98,0)+1,0,100,2),2,0),\"\")","v":""},{"$f":"IF(ROWS($GO$3:GO5)>(ROWS($GO$3:$GO$6)-COUNTBLANK($GO$3:$GO$6)),\"\",INDEX($GO$3:$GO$6,SMALL(IF($GO$3:$GO$6<>\"\",ROW($GO$3:$GO$6)-2),ROWS($GO$3:GO5))))","v":""},{"$f":"IFERROR(IF(FIND(\"Antaba M\",Wycena!$C$61)>0,100,\"\"),\"\")","v":""},{"$f":"IF(ROWS($GQ$3:GQ5)>(ROWS($GQ$3:$GQ$9)-COUNTBLANK($GQ$3:$GQ$9)),\"\",INDEX($GQ$3:$GQ$9,SMALL(IF($GQ$3:$GQ$9<>\"\",ROW($GQ$3:$GQ$9)-2),ROWS($GQ$3:GQ5))))","v":""},"Klasy B czarna",350,{"$f":"IF(OR(Wycena!$C$59=Mapping!$FW$7,Wycena!$C$59=Mapping!$FW$6),\"\",GS5)","v":"Klasy B czarna"},{"$f":"IF(ROWS($GU$3:GU5)>(ROWS($GU$3:$GU$8)-COUNTBLANK($GU$3:$GU$8)),\"\",INDEX($GU$3:$GU$8,SMALL(IF($GU$3:$GU$8<>\"\",ROW($GU$3:$GU$8)-2),ROWS($GU$3:GU5))))","v":"Klasy B czarna"},"Elektrozaczep",{"$f":"IF(Wycena!C59=Mapping!GW18,0,400)","v":400},{"$f":"IF(OR(Wycena!$C$59=Mapping!$GW$18,Wycena!$C$59=Mapping!$GW$15),Mapping!GW5,\"\")","v":"Elektrozaczep"},{"$f":"IFERROR(IF(FIND(\"Klamka\",Wycena!$C$61)>0,\"\",GY5),GY5)","v":"Elektrozaczep"},{"$f":"IF(ROWS($GZ$3:GZ5)>(ROWS($GZ$3:$GZ$5)-COUNTBLANK(GZ$3:$GZ$5)),\"\",INDEX(GZ$3:$GZ$5,SMALL(IF(GZ$3:$GZ$5<>\"\",ROW(GZ$3:$GZ$5)-2),ROWS($GZ$3:GZ5))))","v":"Elektrozaczep"},"x","x","x",null,"W skrzydle i dostawce",800,{"$f":"IF(Wycena!$C$59=Mapping!$HB$31,-400,0)+HG5","v":800},{"$f":"IF(Wycena!$C$6=\"Brak (pełne)\",\"\",HF5)","v":"W skrzydle i dostawce"},{"$f":"IF(OR(AND(Wycena!$C$20=\"-\",Wycena!$C$21<>\"-\"),AND(Wycena!$C$21=\"-\",Wycena!$C$20<>\"-\")),HI5,\"\")","v":""},{"$f":"IF(ROWS($HJ$3:HJ5)>(ROWS($HJ$3:$HJ$13)-COUNTBLANK($HJ$3:$HJ$13)),\"\",INDEX($HJ$3:$HJ$13,SMALL(IF($HJ$3:$HJ$13<>\"\",ROW($HJ$3:$HJ$13)-2),ROWS($HJ$3:HJ5))))","v":""},null,null,null,null,null,null,null,5,70,{"$f":"(1+IFERROR(VLOOKUP(Wycena!$C$45,Mapping!$EZ$3:$FC$6,4,1),0)+IFERROR(VLOOKUP(Wycena!$C$49,Mapping!$EZ$3:$FC$6,4,1),0))*HT5","v":70},null,"Z jednej strony skrzydła i dostawki",100,{"$f":"(1+IFERROR(VLOOKUP(Wycena!$C$45,Mapping!$EZ$3:$FC$6,4,1),0)+IFERROR(VLOOKUP(Wycena!$C$49,Mapping!$EZ$3:$FC$6,4,1),0))*HX5","v":100},200,{"$f":"(1+IFERROR(VLOOKUP(Wycena!$C$45,Mapping!$EZ$3:$FC$6,4,1),0)+IFERROR(VLOOKUP(Wycena!$C$49,Mapping!$EZ$3:$FC$6,4,1),0))*HZ5","v":200},{"$f":"IF(OR(AND(Wycena!$C$20=\"-\",Wycena!$C$21<>\"-\"),AND(Wycena!$C$21=\"-\",Wycena!$C$20<>\"-\")),HW5,\"\")","v":""},{"$f":"IF(ROWS($IB$3:IB5)>(ROWS($IB$3:$IB$9)-COUNTBLANK($IB$3:$IB$9)),\"\",INDEX($IB$3:$IB$9,SMALL(IF($IB$3:$IB$9<>\"\",ROW($IB$3:$IB$9)-2),ROWS($IB$3:IB5))))","v":"Z dwóch stron skrzydła"},null,"Patyna",150,null,"Nawierzchniowy biały",350,null,"Lew retro satyna",400,null,"Na dostawce",200,null,null,null,null,null,null,null,0.02,null,300,null,0.23]
["DB 07",20,20,20,20,34,34,36,36,"Imitacja skrzydła stała",6,null,{"$f":"IFERROR(VLOOKUP(Wycena!$C$5,OFFSET(SKU!$B$1,MATCH(Wycena!$C$5,SKU!$B$1:$B$743,0)+2,0,1000,6),5,0),\"\")","v":""},{"$f":"IFERROR(VLOOKUP(Wycena!$C$5,OFFSET(SKU!$B$1,MATCH(Wycena!$C$5,SKU!$B$1:$B$743,0)+2,0,1000,6),2,0)-VLOOKUP(Wycena!$C$5,SKU!$B$1:$C$743,2,0),\"\")","v":""},{"$f":"IF(ROWS($M$3:M6)>(ROWS($M$3:$M$10)-COUNTBLANK($M$3:$M$10)),\"\",INDEX($M$3:$M$10,SMALL(IF($M$3:$M$10<>\"\",ROW($M$3:$M$10)-2),ROWS($M$3:M6))))","v":""},null,"Dąb flader poprzeczny",900,{"$f":"IF(VLOOKUP(Wycena!$C$5,SKU!$B$1:$D$743,3,0)=\"Płytowe\",Q6,\"\")","v":{"$error":"#N/A"}},{"$f":"IF(ROWS($S$3:S6)>(ROWS($S$3:$S$8)-COUNTBLANK($S$3:$S$8)),\"\",INDEX($S$3:$S$8,SMALL(IF($S$3:$S$8<>\"\",ROW($S$3:$S$8)-2),ROWS($S$3:S6))))","v":{"$error":"#N/A"}},null,"Więcej niż dwa",500,null,"Dąb bagienny",0,"Dąb bagienny",{"$f":"IF((VLOOKUP(Wycena!$C$7,Mapping!$Q$15:$R$20,2,0))=\"tak\",\"\",AA6)","v":"Dąb bagienny"},{"$f":"IF(ROWS($AB$3:AB6)>(ROWS($AB$3:$AB$229)-COUNTBLANK($AB$3:$AB$229)),\"\",INDEX($AB$3:$AB$229,SMALL(IF($AB$3:$AB$229<>\"\",ROW($AB$3:$AB$229)-2),ROWS($AB$3:AB6))))","v":{"$error":"#N/A"}},null,null,null,null,null,{"$f":"IF(VLOOKUP(Wycena!$C$5,SKU!$B$1:$I$743,8,0)>0,\"Węgiel drzewny\",\"\")","v":{"$error":"#N/A"}},{"$f":"VLOOKUP(Wycena!$C$5,SKU!$B$1:$I$743,8,0)","v":{"$error":"#N/A"}},{"$f":"IF(ROWS($AI$3:AI6)>(ROWS($AI$3:$AI$7)-COUNTBLANK($AI$3:$AI$7)),\"\",INDEX($AI$3:$AI$7,SMALL(IF($AI$3:$AI$7<>\"\",ROW($AI$3:$AI$7)-2),ROWS($AI$3:AI6))))","v":{"$error":"#N/A"}},null,"x","x","x","x",null,"x","x","x","x","x",null,75,0,0,{"$f":"IF(Wycena!$C$16=78,Mapping!AY6,AZ6)","v":0},null,null,183,0,0,{"$f":"IF(Wycena!$C$16=78,Mapping!BE6,BF6)","v":0},null,null,null,"Prawe do wewnątrz",{"$f":"IF(Wycena!$C$14=\"Bezprzylgowe Glass\",\"\",BK6)","v":"Prawe do wewnątrz"},{"$f":"IF(ROWS($BL$3:BL6)>(ROWS($BL$3:$BL$6)-COUNTBLANK($BL$3:$BL$6)),\"\",INDEX($BL$3:$BL$6,SMALL(IF($BL$3:$BL$6<>\"\",ROW($BL$3:$BL$6)-2),ROWS($BL$3:BL6))))","v":"Prawe do wewnątrz"},null,"W ościeżnicy z kasetonem",{"$f":"IF(VLOOKUP(Wycena!$C$5,SKU!$B$1:$D$743,3,0)=\"Płytowe\",\"\",BO6)","v":{"$error":"#N/A"}},{"$f":"BP6","v":{"$error":"#N/A"}},{"$f":"IF(Wycena!$C$14=\"Bezprzylgowe Glass\",\"\",BQ6)","v":{"$error":"#N/A"}},{"$f":"IF(ROWS($BR$3:BR6)>(ROWS($BR$3:$BR$8)-COUNTBLANK($BR$3:$BR$8)),\"\",INDEX($BR$3:$BR$8,SMALL(IF($BR$3:$BR$8<>\"\",ROW($BR$3:$BR$8)-2),ROWS($BR$3:BR6))))","v":{"$error":"#N/A"}},null,"W łuku",{"$f":"((2400+IF(Wycena!$F$9<>0,200,0))*(1+IFERROR(VLOOKUP(Wycena!$C$45,Mapping!$EZ$3:$FC$6,4,1),0)+IFERROR(VLOOKUP(Wycena!$C$49,Mapping!$EZ$3:$FC$6,4,1),0))*(1+VLOOKUP(Wycena!$C$54,Mapping!$BW$3:$BX$6,2,1)))","v":{"$error":"#N/A"}},100.0001,null,{"$f":"IF(Wycena!$C$14=\"Bezprzylgowe Glass\",\"\",BU6)","v":"W łuku"},{"$f":"IF(ROWS($BY$3:BY6)>(ROWS($BY$3:$BY$6)-COUNTBLANK($BY$3:$BY$6)),\"\",INDEX($BY$3:$BY$6,SMALL(IF($BY$3:$BY$6<>\"\",ROW($BY$3:$BY$6)-2),ROWS($BY$3:BY6))))","v":"W łuku"},"Lustro weneckie",50,{"$f":"CB6*(1+IFERROR(VLOOKUP(Wycena!$C$45,Mapping!$EZ$3:$FC$6,4,1),0)+IFERROR(VLOOKUP(Wycena!$C$49,Mapping!$EZ$3:$FC$6,4,1),0))*(1+VLOOKUP(Wycena!$C$54,Mapping!$BW$3:$BX$6,2,1))","v":{"$error":"#N/A"}},"Grafit refleks",{"$f":"IF(Wycena!$C$22=\"-\",\"\",CD6)","v":""},{"$f":"IF(ROWS($CE$3:CE6)>(ROWS($CE$3:$CE$13)-COUNTBLANK($CE$3:$CE$13)),\"\",INDEX($CE$3:$CE$13,SMALL(IF($CE$3:$CE$13<>\"\",ROW($CE$3:$CE$13)-2),ROWS($CE$3:CE6))))","v":""},null,null,null,null,null,null,null,null,"Przy skrzydle i ościeżnicy od zewnątrz",{"$f":"1200+((IF(OR(Wycena!$C$20=\"W ościeżnicy nowoczesna\",Wycena!$C$20=\"W ościeżnicy tradycyjna\"),1,0))+(IF(OR(Wycena!$C$21=\"W ościeżnicy nowoczesna\",Wycena!$C$21=\"W ościeżnicy tradycyjna\"),1,0)))*600","v":1200},{"$f":"IF(Wycena!$C$25=\"Krosnowa\",\"\",CO6)","v":"Przy skrzydle i ościeżnicy od zewnątrz"},{"$f":"IF(Wycena!$C$14=\"Bezprzylgowe Glass\",\"\",CQ6)","v":"Przy skrzydle i ościeżnicy od zewnątrz"},{"$f":"IF(OR(Wycena!$C$20=\"W ościeżnicy nowoczesna\",Wycena!$C$20=\"W ościeżnicy tradycyjna\",Wycena!$C$21=\"W ościeżnicy nowoczesna\",Wycena!$C$21=\"W ościeżnicy tradycyjna\"),CR6,\"\")","v":""},{"$f":"CS6","v":""},{"$f":"IF(ROWS($CT$3:CT6)>(ROWS($CT$3:$CT$11)-COUNTBLANK($CT$3:$CT$11)),\"\",INDEX($CT$3:$CT$11,SMALL(IF($CT$3:$CT$11<>\"\",ROW($CT$3:$CT$11)-2),ROWS($CT$3:CT6))))","v":""},null,null,null,null,null,9,{"$f":"IF(DA6>=VLOOKUP(Wycena!$C$14,Mapping!$CY$3:$CZ$5,2,0),DA6,\"\")","v":9},{"$f":"IF(ROWS($DB$3:DB6)>(ROWS($DB$3:$DB$28)-COUNTBLANK($DB$3:$DB$28)),\"\",INDEX($DB$3:$DB$28,SMALL(IF($DB$3:$DB$28<>\"\",ROW($DB$3:$DB$28)-2),ROWS($DB$3:DB6))))","v":9},null,null,null,null,null,null,null,9,{"$f":"IF(DK6>=VLOOKUP(Wycena!$C$14,Mapping!$DG$3:$DH$5,2,0),DK6,\"\")","v":9},{"$f":"IF(ROWS($DL$3:DL6)>(ROWS($DL$3:$DL$28)-COUNTBLANK($DL$3:$DL$28)),\"\",INDEX($DL$3:$DL$28,SMALL(IF($DL$3:$DL$28<>\"\",ROW($DL$3:$DL$28)-2),ROWS($DL$3:DL6))))","v":9},{"$f":"IF(DK6>=VLOOKUP(Wycena!$C$14,Mapping!$DG$3:$DI$5,3,0),DK6,\"\")","v":9},{"$f":"IF(ROWS($DN$3:DN6)>(ROWS($DN$3:$DN$28)-COUNTBLANK($DN$3:$DN$28)),\"\",INDEX($DN$3:$DN$28,SMALL(IF($DN$3:$DN$28<>\"\",ROW($DN$3:$DN$28)-2),ROWS($DN$3:DN6))))","v":9},null,null,null,9,{"$f":"IF(DS6>=VLOOKUP(Wycena!$C$25,Mapping!$DQ$3:$DR$4,2,0),DS6,\"\")","v":""},{"$f":"IF(ROWS($DT$3:DT6)>(ROWS($DT$3:$DT$28)-COUNTBLANK($DT$3:$DT$28)),\"\",INDEX($DT$3:$DT$28,SMALL(IF($DT$3:$DT$28<>\"\",ROW($DT$3:$DT$28)-2),ROWS($DT$3:DT6))))","v":13},null,3,null,null,null,null,null,null,null,null,null,null,null,null,null,null,null,100,100.001,900,{"$f":"IF(OR(Wycena!$C$20<>\"-\",Wycena!$C$21<>\"-\",),EM6,\"\")","v":""},{"$f":"IF(ROWS($EP$3:EP6)>(ROWS($EP$3:$EP$8)-COUNTBLANK($EP$3:$EP$8)),\"\",INDEX($EP$3:$EP$8,SMALL(IF($EP$3:$EP$8<>\"\",ROW($EP$3:$EP$8)-2),ROWS($EP$3:EP6))))","v":""},null,224,224.001,0.3,{"$f":"IF(IF(Wycena!$C$22<>\"-\",ES6,\"\")<=Wycena!$C$18-Wycena!$C$27,ES6,\"\")","v":""},{"$f":"IF(ROWS($EV$3:EV6)>(ROWS($EV$3:$EV$8)-COUNTBLANK($EV$3:$EV$8)),\"\",INDEX($EV$3:$EV$8,SMALL(IF($EV$3:$EV$8<>\"\",ROW($EV$3:$EV$8)-2),ROWS($EV$3:EV6))))","v":""},null,100,100.001,null,null,null,null,"Grafit refleks",250,"Grafit refleks",{"$f":"IF(Wycena!$C$20=\"-\",\"\",FG6)","v":""},{"$f":"IF(ROWS($FH$3:FH6)>(ROWS($FH$3:$FH$14)-COUNTBLANK($FH$3:$FH$14)),\"\",INDEX($FH$3:$FH$14,SMALL(IF($FH$3:$FH$14<>\"\",ROW($FH$3:$FH$14)-2),ROWS($FH$3:FH6))))","v":""},"Grafit refleks",{"$f":"IF(Wycena!$C$21=\"-\",\"\",FJ6)","v":""},{"$f":"IF(ROWS($FK$3:FK6)>(ROWS($FK$3:$FK$14)-COUNTBLANK($FK$3:$FK$14)),\"\",INDEX($FK$3:$FK$14,SMALL(IF($FK$3:$FK$14<>\"\",ROW($FK$3:$FK$14)-2),ROWS($FK$3:FK6))))","v":""},null,100,3,{"$f":"IF(Wycena!$C$20=\"-\",\"\",FO6)","v":""},{"$f":"IF(ROWS($FP$3:FP6)>(ROWS($FP$3:$FP$23)-COUNTBLANK($FP$3:$FP$23)),\"\",INDEX($FP$3:$FP$23,SMALL(IF($FP$3:$FP$23<>\"\",ROW($FP$3:$FP$23)-2),ROWS($FP$3:FP6))))","v":""},{"$f":"IF(Wycena!$C$21=\"-\",\"\",FO6)","v":""},{"$f":"IF(ROWS($FR$3:FR6)>(ROWS($FR$3:$FR$23)-COUNTBLANK($FR$3:$FR$23)),\"\",INDEX($FR$3:$FR$23,SMALL(IF($FR$3:$FR$23<>\"\",ROW($FR$3:$FR$23)-2),ROWS($FR$3:FR6))))","v":""},{"$f":"IF(Wycena!$C$22=\"-\",\"\",FO6)","v":""},{"$f":"IF(ROWS($FT$3:FT6)>(ROWS($FT$3:$FT$23)-COUNTBLANK($FT$3:$FT$23)),\"\",INDEX($FT$3:$FT$23,SMALL(IF($FT$3:$FT$23<>\"\",ROW($FT$3:$FT$23)-2),ROWS($FT$3:FT6))))","v":""},null,"Zestaw z pochwytem na styl amerykański",2500,{"$f":"IFERROR(VLOOKUP(Wycena!C59,OFFSET(FW15,MATCH(Wycena!C59,FW15:FW39,0)+2,0,15,2),2,0),\"\")","v":"Automat 3-punktowy z gałką"},{"$f":"IF(ROWS($FY$3:FY6)>(ROWS($FY$3:$FY$10)-COUNTBLANK($FY$3:$FY$10)),\"\",INDEX($FY$3:$FY$10,SMALL(IF($FY$3:$FY$10<>\"\",ROW($FY$3:$FY$10)-2),ROWS($FY$3:FY6))))","v":"Automat 3-punktowy z gałką"},"Klamka Hoppe Bezpieczna",350,"Klamka Hoppe Bezpieczna","Klamka Hoppe Bezpieczna",null,null,null,null,null,{"$f":"IF((HLOOKUP(VLOOKUP(Wycena!$C$59,Mapping!$GI$35:$GJ$43,2,0),$GD$1:$GI$33,2+GK6))=0,\"\",(HLOOKUP(VLOOKUP(Wycena!$C$59,Mapping!$GI$35:$GJ$43,2,0),$GD$1:$GI$33,2+GK6)))","v":"Klamka Hoppe Bezpieczna"},4,{"$f":"IF(ROWS($GJ$3:GJ6)>(ROWS($GJ$3:$GJ$33)-COUNTBLANK($GJ$3:$GJ$33)),\"\",INDEX($GJ$3:$GJ$33,SMALL(IF($GJ$3:$GJ$33<>\"\",ROW($GJ$3:$GJ$33)-2),ROWS($GJ$3:GJ6))))","v":{"$error":"#N/A"}},"Klamka Medos Dublin","Inox",{"$f":"IFERROR(VLOOKUP(Wycena!C61,OFFSET(GM2,MATCH(Wycena!C61,$GM$2:$GM$98,0)+2,0,100,2),2,0),\"\")","v":""},{"$f":"IF(ROWS($GO$3:GO6)>(ROWS($GO$3:$GO$6)-COUNTBLANK($GO$3:$GO$6)),\"\",INDEX($GO$3:$GO$6,SMALL(IF($GO$3:$GO$6<>\"\",ROW($GO$3:$GO$6)-2),ROWS($GO$3:GO6))))","v":""},{"$f":"IFERROR(IF(FIND(\"Antaba M\",Wycena!$C$61)>0,120,\"\"),\"\")","v":""},{"$f":"IF(ROWS($GQ$3:GQ6)>(ROWS($GQ$3:$GQ$9)-COUNTBLANK($GQ$3:$GQ$9)),\"\",INDEX($GQ$3:$GQ$9,SMALL(IF($GQ$3:$GQ$9<>\"\",ROW($GQ$3:$GQ$9)-2),ROWS($GQ$3:GQ6))))","v":""},"Klasy C patyna",{"$f":"350-IF(Wycena!C59=Mapping!FY31,350,0)","v":350},{"$f":"IF(Wycena!$C$59=Mapping!FW6,\"\",IF(Wycena!$C$59=Mapping!FW7,GS6,GS6))","v":"Klasy C patyna"},{"$f":"IF(ROWS($GU$3:GU6)>(ROWS($GU$3:$GU$8)-COUNTBLANK($GU$3:$GU$8)),\"\",INDEX($GU$3:$GU$8,SMALL(IF($GU$3:$GU$8<>\"\",ROW($GU$3:$GU$8)-2),ROWS($GU$3:GU6))))","v":"Klasy C patyna"},null,null,"x","x","x",null,null,null,null,"W skrzydle i dostawkach",1200,{"$f":"IF(Wycena!$C$59=Mapping!$HB$31,-400,0)+HG6","v":1200},{"$f":"IF(Wycena!$C$6=\"Brak (pełne)\",\"\",HF6)","v":"W skrzydle i dostawkach"},{"$f":"IF(AND(Wycena!$C$20<>\"-\",Wycena!$C$21<>\"-\"),HI6,\"\")","v":""},{"$f":"IF(ROWS($HJ$3:HJ6)>(ROWS($HJ$3:$HJ$13)-COUNTBLANK($HJ$3:$HJ$13)),\"\",INDEX($HJ$3:$HJ$13,SMALL(IF($HJ$3:$HJ$13<>\"\",ROW($HJ$3:$HJ$13)-2),ROWS($HJ$3:HJ6))))","v":""},null,"x","x","x","x","x",null,8,130,{"$f":"(1+IFERROR(VLOOKUP(Wycena!$C$45,Mapping!$EZ$3:$FC$6,4,1),0)+IFERROR(VLOOKUP(Wycena!$C$49,Mapping!$EZ$3:$FC$6,4,1),0))*HT6","v":130},null,"Z jednej strony skrzydła i dostawek",100,{"$f":"(1+IFERROR(VLOOKUP(Wycena!$C$45,Mapping!$EZ$3:$FC$6,4,1),0)+IFERROR(VLOOKUP(Wycena!$C$49,Mapping!$EZ$3:$FC$6,4,1),0))*HX6","v":100},200,{"$f":"(1+IFERROR(VLOOKUP(Wycena!$C$45,Mapping!$EZ$3:$FC$6,4,1),0)+IFERROR(VLOOKUP(Wycena!$C$49,Mapping!$EZ$3:$FC$6,4,1),0))*HZ6","v":200},{"$f":"IF(AND(Wycena!$C$20<>\"-\",Wycena!$C$21<>\"-\"),HW6,\"\")","v":""},{"$f":"IF(ROWS($IB$3:IB6)>(ROWS($IB$3:$IB$9)-COUNTBLANK($IB$3:$IB$9)),\"\",INDEX($IB$3:$IB$9,SMALL(IF($IB$3:$IB$9<>\"\",ROW($IB$3:$IB$9)-2),ROWS($IB$3:IB6))))","v":""},null,"Czarny",150,null,"Nawierzchniowy brąz",350,null,null,null,null,null,null,null,null,null,null,null,null,null,0.03,null,400,null,null,null,"Przylgowe","-",null,"x"]
["DB 09a",20,20,20,20,34,34,36,36,"Imitacja skrzydła ruchoma",8,null,{"$f":"IFERROR(VLOOKUP(Wycena!$C$5,OFFSET(SKU!$B$1,MATCH(Wycena!$C$5,SKU!$B$1:$B$743,0)+3,0,1000,6),5,0),\"\")","v":""},{"$f":"IFERROR(VLOOKUP(Wycena!$C$5,OFFSET(SKU!$B$1,MATCH(Wycena!$C$5,SKU!$B$1:$B$743,0)+3,0,1000,6),2,0)-VLOOKUP(Wycena!$C$5,SKU!$B$1:$C$743,2,0),\"\")","v":""},{"$f":"IF(ROWS($M$3:M7)>(ROWS($M$3:$M$10)-COUNTBLANK($M$3:$M$10)),\"\",INDEX($M$3:$M$10,SMALL(IF($M$3:$M$10<>\"\",ROW($M$3:$M$10)-2),ROWS($M$3:M7))))","v":""},null,"Dąb sękaty podłużny",1200,{"$f":"IF(VLOOKUP(Wycena!$C$5,SKU!$B$1:$D$743,3,0)=\"Płytowe\",Q7,\"\")","v":{"$error":"#N/A"}},{"$f":"IF(ROWS($S$3:S7)>(ROWS($S$3:$S$8)-COUNTBLANK($S$3:$S$8)),\"\",INDEX($S$3:$S$8,SMALL(IF($S$3:$S$8<>\"\",ROW($S$3:$S$8)-2),ROWS($S$3:S7))))","v":{"$error":"#N/A"}},null,null,null,null,"Dąb natura",500,{"$f":"IF(VLOOKUP(Wycena!$C$5,SKU!$B$1:$D$743,3,0)=\"Płytowe\",Y7,\"\")","v":{"$error":"#N/A"}},{"$f":"AA7","v":{"$error":"#N/A"}},{"$f":"IF(ROWS($AB$3:AB7)>(ROWS($AB$3:$AB$229)-COUNTBLANK($AB$3:$AB$229)),\"\",INDEX($AB$3:$AB$229,SMALL(IF($AB$3:$AB$229<>\"\",ROW($AB$3:$AB$229)-2),ROWS($AB$3:AB7))))","v":{"$error":"#N/A"}},null,null,null,{"$f":"$AG$3:INDEX($AG$3:$AG$4,(ROWS($AE$3:$AE$4)-COUNTBLANK($AE$3:$AE$4)))","v":{"$error":"#N/A"}},null,{"$f":"IF(VLOOKUP(Wycena!$C$5,SKU!$B$1:$I$743,8,0)>0,\"Złota patyna\",\"\")","v":{"$error":"#N/A"}},{"$f":"VLOOKUP(Wycena!$C$5,SKU!$B$1:$I$743,8,0)","v":{"$error":"#N/A"}},{"$f":"IF(ROWS($AI$3:AI7)>(ROWS($AI$3:$AI$7)-COUNTBLANK($AI$3:$AI$7)),\"\",INDEX($AI$3:$AI$7,SMALL(IF($AI$3:$AI$7<>\"\",ROW($AI$3:$AI$7)-2),ROWS($AI$3:AI7))))","v":{"$error":"#N/A"}},null,null,null,null,null,null,null,null,null,null,null,null,76,0,0,{"$f":"IF(Wycena!$C$16=78,Mapping!AY7,AZ7)","v":0},null,null,184,0,0,{"$f":"IF(Wycena!$C$16=78,Mapping!BE7,BF7)","v":0},null,null,null,"x","x","x",null,"Imitacja skrzydła stała","Imitacja skrzydła stała",{"$f":"IF(VLOOKUP(Wycena!C5,SKU!$B$1:$E$743,4,0)=\"Prestige Kamień\",\"\",BP7)","v":{"$error":"#N/A"}},{"$f":"BQ7","v":{"$error":"#N/A"}},{"$f":"IF(ROWS($BR$3:BR7)>(ROWS($BR$3:$BR$8)-COUNTBLANK($BR$3:$BR$8)),\"\",INDEX($BR$3:$BR$8,SMALL(IF($BR$3:$BR$8<>\"\",ROW($BR$3:$BR$8)-2),ROWS($BR$3:BR7))))","v":{"$error":"#N/A"}},null,"x",null,null,null,"x","x","Mleczne",150,{"$f":"CB7*(1+IFERROR(VLOOKUP(Wycena!$C$45,Mapping!$EZ$3:$FC$6,4,1),0)+IFERROR(VLOOKUP(Wycena!$C$49,Mapping!$EZ$3:$FC$6,4,1),0))*(1+VLOOKUP(Wycena!$C$54,Mapping!$BW$3:$BX$6,2,1))","v":{"$error":"#N/A"}},"Lustro weneckie",{"$f":"IF(Wycena!$C$22=\"-\",\"\",CD7)","v":""},{"$f":"IF(ROWS($CE$3:CE7)>(ROWS($CE$3:$CE$13)-COUNTBLANK($CE$3:$CE$13)),\"\",INDEX($CE$3:$CE$13,SMALL(IF($CE$3:$CE$13<>\"\",ROW($CE$3:$CE$13)-2),ROWS($CE$3:CE7))))","v":""},null,null,null,null,null,null,{"$f":"$CM$3:INDEX($CM$3:$CM$4,(ROWS($CL$3:$CL$4)-COUNTBLANK($CL$3:$CL$4)))","v":"Standardowa"},null,"Przy skrzydle i ościeżnicy z dwóch stron",{"$f":"1600+((IF(OR(Wycena!$C$20=\"W ościeżnicy nowoczesna\",Wycena!$C$20=\"W ościeżnicy tradycyjna\"),1,0))+(IF(OR(Wycena!$C$21=\"W ościeżnicy nowoczesna\",Wycena!$C$21=\"W ościeżnicy tradycyjna\"),1,0)))*800","v":1600},{"$f":"IF(Wycena!$C$25=\"Krosnowa\",\"\",CO7)","v":"Przy skrzydle i ościeżnicy z dwóch stron"},{"$f":"IF(Wycena!$C$14=\"Bezprzylgowe Glass\",\"\",CQ7)","v":"Przy skrzydle i ościeżnicy z dwóch stron"},{"$f":"IF(OR(Wycena!$C$20=\"W ościeżnicy nowoczesna\",Wycena!$C$20=\"W ościeżnicy tradycyjna\",Wycena!$C$21=\"W ościeżnicy nowoczesna\",Wycena!$C$21=\"W ościeżnicy tradycyjna\"),CR7,\"\")","v":""},{"$f":"CS7","v":""},{"$f":"IF(ROWS($CT$3:CT7)>(ROWS($CT$3:$CT$11)-COUNTBLANK($CT$3:$CT$11)),\"\",INDEX($CT$3:$CT$11,SMALL(IF($CT$3:$CT$11<>\"\",ROW($CT$3:$CT$11)-2),ROWS($CT$3:CT7))))","v":""},null,null,null,"vlookup ościeżnicy","grubość pod liczenie",10,{"$f":"IF(DA7>=VLOOKUP(Wycena!$C$14,Mapping!$CY$3:$CZ$5,2,0),DA7,\"\")","v":10},{"$f":"IF(ROWS($DB$3:DB7)>(ROWS($DB$3:$DB$28)-COUNTBLANK($DB$3:$DB$28)),\"\",INDEX($DB$3:$DB$28,SMALL(IF($DB$3:$DB$28<>\"\",ROW($DB$3:$DB$28)-2),ROWS($DB$3:DB7))))","v":10},null,null,null,"vlookup ościeżnicy","grubość pod liczenie","grubość pod liczenie",null,10,{"$f":"IF(DK7>=VLOOKUP(Wycena!$C$14,Mapping!$DG$3:$DH$5,2,0),DK7,\"\")","v":10},{"$f":"IF(ROWS($DL$3:DL7)>(ROWS($DL$3:$DL$28)-COUNTBLANK($DL$3:$DL$28)),\"\",INDEX($DL$3:$DL$28,SMALL(IF($DL$3:$DL$28<>\"\",ROW($DL$3:$DL$28)-2),ROWS($DL$3:DL7))))","v":10},{"$f":"IF(DK7>=VLOOKUP(Wycena!$C$14,Mapping!$DG$3:$DI$5,3,0),DK7,\"\")","v":10},{"$f":"IF(ROWS($DN$3:DN7)>(ROWS($DN$3:$DN$28)-COUNTBLANK($DN$3:$DN$28)),\"\",INDEX($DN$3:$DN$28,SMALL(IF($DN$3:$DN$28<>\"\",ROW($DN$3:$DN$28)-2),ROWS($DN$3:DN7))))","v":10},null,"vlookup rodzaj","szerokości pod liczenie",10,{"$f":"IF(DS7>=VLOOKUP(Wycena!$C$25,Mapping!$DQ$3:$DR$4,2,0),DS7,\"\")","v":""},{"$f":"IF(ROWS($DT$3:DT7)>(ROWS($DT$3:$DT$28)-COUNTBLANK($DT$3:$DT$28)),\"\",INDEX($DT$3:$DT$28,SMALL(IF($DT$3:$DT$28<>\"\",ROW($DT$3:$DT$28)-2),ROWS($DT$3:DT7))))","v":14},null,4,null,"dopłaty","stawka",null,"dopłaty","stawka",null,{"$f":"$EE$3:INDEX($EE$3:$EE$4,(ROWS($ED$3:$ED$4)-COUNTBLANK($ED$3:$ED$4)))","v":"-"},null,"dopłaty","stawka",null,"dopłaty","stawka",null,108,108.001,1500,{"$f":"IF(OR(Wycena!$C$20<>\"-\",Wycena!$C$21<>\"-\",),EM7,\"\")","v":""},{"$f":"IF(ROWS($EP$3:EP7)>(ROWS($EP$3:$EP$8)-COUNTBLANK($EP$3:$EP$8)),\"\",INDEX($EP$3:$EP$8,SMALL(IF($EP$3:$EP$8<>\"\",ROW($EP$3:$EP$8)-2),ROWS($EP$3:EP7))))","v":""},null,234,234.001,0.4,{"$f":"IF(IF(Wycena!$C$22<>\"-\",ES7,\"\")<=Wycena!$C$18-Wycena!$C$27,ES7,\"\")","v":""},{"$f":"IF(ROWS($EV$3:EV7)>(ROWS($EV$3:$EV$8)-COUNTBLANK($EV$3:$EV$8)),\"\",INDEX($EV$3:$EV$8,SMALL(IF($EV$3:$EV$8<>\"\",ROW($EV$3:$EV$8)-2),ROWS($EV$3:EV7))))","v":""},null,null,null,null,null,null,null,"Lustro weneckie",250,"Lustro weneckie",{"$f":"IF(Wycena!$C$20=\"-\",\"\",FG7)","v":""},{"$f":"IF(ROWS($FH$3:FH7)>(ROWS($FH$3:$FH$14)-COUNTBLANK($FH$3:$FH$14)),\"\",INDEX($FH$3:$FH$14,SMALL(IF($FH$3:$FH$14<>\"\",ROW($FH$3:$FH$14)-2),ROWS($FH$3:FH7))))","v":""},"Lustro weneckie",{"$f":"IF(Wycena!$C$21=\"-\",\"\",FJ7)","v":""},{"$f":"IF(ROWS($FK$3:FK7)>(ROWS($FK$3:$FK$14)-COUNTBLANK($FK$3:$FK$14)),\"\",INDEX($FK$3:$FK$14,SMALL(IF($FK$3:$FK$14<>\"\",ROW($FK$3:$FK$14)-2),ROWS($FK$3:FK7))))","v":""},null,null,4,{"$f":"IF(Wycena!$C$20=\"-\",\"\",FO7)","v":""},{"$f":"IF(ROWS($FP$3:FP7)>(ROWS($FP$3:$FP$23)-COUNTBLANK($FP$3:$FP$23)),\"\",INDEX($FP$3:$FP$23,SMALL(IF($FP$3:$FP$23<>\"\",ROW($FP$3:$FP$23)-2),ROWS($FP$3:FP7))))","v":""},{"$f":"IF(Wycena!$C$21=\"-\",\"\",FO7)","v":""},{"$f":"IF(ROWS($FR$3:FR7)>(ROWS($FR$3:$FR$23)-COUNTBLANK($FR$3:$FR$23)),\"\",INDEX($FR$3:$FR$23,SMALL(IF($FR$3:$FR$23<>\"\",ROW($FR$3:$FR$23)-2),ROWS($FR$3:FR7))))","v":""},{"$f":"IF(Wycena!$C$22=\"-\",\"\",FO7)","v":""},{"$f":"IF(ROWS($FT$3:FT7)>(ROWS($FT$3:$FT$23)-COUNTBLANK($FT$3:$FT$23)),\"\",INDEX($FT$3:$FT$23,SMALL(IF($FT$3:$FT$23<>\"\",ROW($FT$3:$FT$23)-2),ROWS($FT$3:FT7))))","v":""},"x","Zestaw antywłamaniowy RC2",{"$f":"1100+IF(Wycena!$C$6=\"Brak (pełne)\",0,400)","v":1500},{"$f":"IFERROR(VLOOKUP(Wycena!C59,OFFSET(FW15,MATCH(Wycena!C59,FW15:FW39,0)+3,0,15,2),2,0),\"\")","v":"Automat 3-punktowy bez gałki"},{"$f":"IF(ROWS($FY$3:FY7)>(ROWS($FY$3:$FY$10)-COUNTBLANK($FY$3:$FY$10)),\"\",INDEX($FY$3:$FY$10,SMALL(IF($FY$3:$FY$10<>\"\",ROW($FY$3:$FY$10)-2),ROWS($FY$3:FY7))))","v":"Automat 3-punktowy bez gałki"},"Klamka AXA Diva Flex",{"$f":"480-IFERROR(IF(Wycena!C59=Mapping!FY31,480,0),0)","v":480},"Klamka AXA Diva Flex","Klamka AXA Diva Flex",null,null,null,{"$f":"GC7","v":"Klamka AXA Diva Flex"},null,{"$f":"IF((HLOOKUP(VLOOKUP(Wycena!$C$59,Mapping!$GI$35:$GJ$43,2,0),$GD$1:$GI$33,2+GK7))=0,\"\",(HLOOKUP(VLOOKUP(Wycena!$C$59,Mapping!$GI$35:$GJ$43,2,0),$GD$1:$GI$33,2+GK7)))","v":"Klamka AXA Diva Flex"},5,{"$f":"IF(ROWS($GJ$3:GJ7)>(ROWS($GJ$3:$GJ$33)-COUNTBLANK($GJ$3:$GJ$33)),\"\",INDEX($GJ$3:$GJ$33,SMALL(IF($GJ$3:$GJ$33<>\"\",ROW($GJ$3:$GJ$33)-2),ROWS($GJ$3:GJ7))))","v":{"$error":"#N/A"}},"Klamka Medos Dublin","Stare złoto","x","x",{"$f":"IFERROR(IF(FIND(\"Antaba M\",Wycena!$C$61)>0,150,\"\"),\"\")","v":""},{"$f":"IF(ROWS($GQ$3:GQ7)>(ROWS($GQ$3:$GQ$9)-COUNTBLANK($GQ$3:$GQ$9)),\"\",INDEX($GQ$3:$GQ$9,SMALL(IF($GQ$3:$GQ$9<>\"\",ROW($GQ$3:$GQ$9)-2),ROWS($GQ$3:GQ7))))","v":""},"Klasy C satyna",{"$f":"350-IF(Wycena!C59=Mapping!FY31,350,0)","v":350},{"$f":"IF(Wycena!$C$59=Mapping!FW6,\"\",IF(Wycena!$C$59=Mapping!FW7,GS7,GS7))","v":"Klasy C satyna"},{"$f":"IF(ROWS($GU$3:GU7)>(ROWS($GU$3:$GU$8)-COUNTBLANK($GU$3:$GU$8)),\"\",INDEX($GU$3:$GU$8,SMALL(IF($GU$3:$GU$8<>\"\",ROW($GU$3:$GU$8)-2),ROWS($GU$3:GU7))))","v":"Klasy C satyna"},null,null,null,null,null,null,null,{"$f":"$HD$3:INDEX($HD$3:$HD$4,(ROWS($HB$3:$HB$4)-COUNTBLANK($HB$3:$HB$4)))","v":"-"},null,"W skrzydle i naświetlu",800,{"$f":"IF(Wycena!$C$59=Mapping!$HB$31,-400,0)+HG7","v":800},{"$f":"IF(Wycena!$C$6=\"Brak (pełne)\",\"\",HF7)","v":"W skrzydle i naświetlu"},{"$f":"IF(AND(Wycena!$C$20=\"-\",Wycena!$C$21=\"-\",Wycena!$C$22<>\"-\"),HI7,\"\")","v":""},{"$f":"IF(ROWS($HJ$3:HJ7)>(ROWS($HJ$3:$HJ$13)-COUNTBLANK($HJ$3:$HJ$13)),\"\",INDEX($HJ$3:$HJ$13,SMALL(IF($HJ$3:$HJ$13<>\"\",ROW($HJ$3:$HJ$13)-2),ROWS($HJ$3:HJ7))))","v":""},null,null,null,null,null,null,null,10,110,{"$f":"(1+IFERROR(VLOOKUP(Wycena!$C$45,Mapping!$EZ$3:$FC$6,4,1),0)+IFERROR(VLOOKUP(Wycena!$C$49,Mapping!$EZ$3:$FC$6,4,1),0))*HT7","v":110},null,"Z dwóch stron skrzydła",200,200,400,400,"Z dwóch stron skrzydła",{"$f":"IF(ROWS($IB$3:IB7)>(ROWS($IB$3:$IB$9)-COUNTBLANK($IB$3:$IB$9)),\"\",INDEX($IB$3:$IB$9,SMALL(IF($IB$3:$IB$9<>\"\",ROW($IB$3:$IB$9)-2),ROWS($IB$3:IB7))))","v":""},null,null,null,null,"Nawierzchniowy czarny",350,null,null,null,null,null,null,null,null,null,null,null,null,null,0.04,null,500,null,null,null,"Bezprzylgowe","czarny",null,{"$f":"$JF$3:INDEX($JF$3:$JF$4,(ROWS($JD$3:$JD$4)-COUNTBLANK($JD$3:$JD$4)))","v":"Inox"}]
["DB 10",20,20,20,20,34,34,36,36,null,null,null,{"$f":"IFERROR(VLOOKUP(Wycena!$C$5,OFFSET(SKU!$B$1,MATCH(Wycena!$C$5,SKU!$B$1:$B$743,0)+4,0,1000,6),5,0),\"\")","v":""},{"$f":"IFERROR(VLOOKUP(Wycena!$C$5,OFFSET(SKU!$B$1,MATCH(Wycena!$C$5,SKU!$B$1:$B$743,0)+4,0,1000,6),2,0)-VLOOKUP(Wycena!$C$5,SKU!$B$1:$C$743,2,0),\"\")","v":""},{"$f":"IF(ROWS($M$3:M8)>(ROWS($M$3:$M$10)-COUNTBLANK($M$3:$M$10)),\"\",INDEX($M$3:$M$10,SMALL(IF($M$3:$M$10<>\"\",ROW($M$3:$M$10)-2),ROWS($M$3:M8))))","v":""},null,"Dąb sękaty poprzeczny",1200,{"$f":"IF(VLOOKUP(Wycena!$C$5,SKU!$B$1:$D$743,3,0)=\"Płytowe\",Q8,\"\")","v":{"$error":"#N/A"}},{"$f":"IF(ROWS($S$3:S8)>(ROWS($S$3:$S$8)-COUNTBLANK($S$3:$S$8)),\"\",INDEX($S$3:$S$8,SMALL(IF($S$3:$S$8<>\"\",ROW($S$3:$S$8)-2),ROWS($S$3:S8))))","v":{"$error":"#N/A"}},null,null,null,null,"Jasny orzech",0,"Jasny orzech",{"$f":"IF((VLOOKUP(Wycena!$C$7,Mapping!$Q$15:$R$20,2,0))=\"tak\",\"\",AA8)","v":"Jasny orzech"},{"$f":"IF(ROWS($AB$3:AB8)>(ROWS($AB$3:$AB$229)-COUNTBLANK($AB$3:$AB$229)),\"\",INDEX($AB$3:$AB$229,SMALL(IF($AB$3:$AB$229<>\"\",ROW($AB$3:$AB$229)-2),ROWS($AB$3:AB8))))","v":{"$error":"#N/A"}},null,null,null,null,null,"x",null,"x",null,null,null,null,{"$f":"$AP$3:INDEX($AP$3:$AP$5,(ROWS($AN$3:$AN$5)-COUNTBLANK($AN$3:$AN$5)))","v":{"$error":"#N/A"}},null,null,null,null,null,{"$f":"$AV$3:INDEX($AV$3:$AV$5,(ROWS($AT$3:$AT$5)-COUNTBLANK($AT$3:$AT$5)))","v":78},null,77,0,0,{"$f":"IF(Wycena!$C$16=78,Mapping!AY8,AZ8)","v":0},null,null,185,0,0,{"$f":"IF(Wycena!$C$16=78,Mapping!BE8,BF8)","v":0},null,null,null,null,null,null,null,"Imitacja skrzydła ruchoma","Imitacja skrzydła ruchoma",{"$f":"IF(VLOOKUP(Wycena!C5,SKU!$B$1:$E$743,4,0)=\"Prestige Kamień\",\"\",BP8)","v":{"$error":"#N/A"}},{"$f":"IF(Wycena!$C$14=\"Bezprzylgowe Glass\",\"\",BQ8)","v":{"$error":"#N/A"}},{"$f":"IF(ROWS($BR$3:BR8)>(ROWS($BR$3:$BR$8)-COUNTBLANK($BR$3:$BR$8)),\"\",INDEX($BR$3:$BR$8,SMALL(IF($BR$3:$BR$8<>\"\",ROW($BR$3:$BR$8)-2),ROWS($BR$3:BR8))))","v":{"$error":"#N/A"}},null,null,null,null,null,null,null,"Piaskowane refleks",150,{"$f":"CB8*(1+IFERROR(VLOOKUP(Wycena!$C$45,Mapping!$EZ$3:$FC$6,4,1),0)+IFERROR(VLOOKUP(Wycena!$C$49,Mapping!$EZ$3:$FC$6,4,1),0))*(1+VLOOKUP(Wycena!$C$54,Mapping!$BW$3:$BX$6,2,1))","v":{"$error":"#N/A"}},"Mleczne",{"$f":"IF(Wycena!$C$22=\"-\",\"\",CD8)","v":""},{"$f":"IF(ROWS($CE$3:CE8)>(ROWS($CE$3:$CE$13)-COUNTBLANK($CE$3:$CE$13)),\"\",INDEX($CE$3:$CE$13,SMALL(IF($CE$3:$CE$13<>\"\",ROW($CE$3:$CE$13)-2),ROWS($CE$3:CE8))))","v":""},null,null,null,null,null,null,null,null,"Przy skrzydle i naświetlu od zewnątrz",1200,{"$f":"IF(Wycena!$C$25=\"Krosnowa\",\"\",CO8)","v":"Przy skrzydle i naświetlu od zewnątrz"},{"$f":"IF(Wycena!$C$14=\"Bezprzylgowe Glass\",\"\",CQ8)","v":"Przy skrzydle i naświetlu od zewnątrz"},{"$f":"CR8","v":"Przy skrzydle i naświetlu od zewnątrz"},{"$f":"IF(Wycena!$C$22=\"W ościeżnicy\",CS8,\"\")","v":""},{"$f":"IF(ROWS($CT$3:CT8)>(ROWS($CT$3:$CT$11)-COUNTBLANK($CT$3:$CT$11)),\"\",INDEX($CT$3:$CT$11,SMALL(IF($CT$3:$CT$11<>\"\",ROW($CT$3:$CT$11)-2),ROWS($CT$3:CT8))))","v":""},null,null,null,"Przylgowe",{"$f":"VLOOKUP(Wycena!$C$25,Mapping!$CW$3:$CX$4,2,0)","v":6},10.5,{"$f":"IF(OR(DB3=6,DB5=8),\"\",IF(DA8>=VLOOKUP(Wycena!$C$14,Mapping!$CY$3:$CZ$5,2,0),DA8,\"\"))","v":""},{"$f":"IF(ROWS($DB$3:DB8)>(ROWS($DB$3:$DB$28)-COUNTBLANK($DB$3:$DB$28)),\"\",INDEX($DB$3:$DB$28,SMALL(IF($DB$3:$DB$28<>\"\",ROW($DB$3:$DB$28)-2),ROWS($DB$3:DB8))))","v":11},null,null,null,"Przylgowe",{"$f":"DH3","v":6},{"$f":"DI3","v":6},null,10.5,{"$f":"IF(OR(DL3=6,DL5=8),\"\",IF(DK8>=VLOOKUP(Wycena!$C$14,Mapping!$DG$3:$DH$5,2,0),DK8,\"\"))","v":""},{"$f":"IF(ROWS($DL$3:DL8)>(ROWS($DL$3:$DL$28)-COUNTBLANK($DL$3:$DL$28)),\"\",INDEX($DL$3:$DL$28,SMALL(IF($DL$3:$DL$28<>\"\",ROW($DL$3:$DL$28)-2),ROWS($DL$3:DL8))))","v":11},{"$f":"IF(OR(DL3=6,DL5=8),\"\",IF(DK8>=VLOOKUP(Wycena!$C$14,Mapping!$DG$3:$DI$5,3,0),DK8,\"\"))","v":""},{"$f":"IF(ROWS($DN$3:DN8)>(ROWS($DN$3:$DN$28)-COUNTBLANK($DN$3:$DN$28)),\"\",INDEX($DN$3:$DN$28,SMALL(IF($DN$3:$DN$28<>\"\",ROW($DN$3:$DN$28)-2),ROWS($DN$3:DN8))))","v":11},null,"standardowa",10.5,10.5,{"$f":"IF(DT3=6,\"\",IF(DS8>=VLOOKUP(Wycena!$C$25,Mapping!$DQ$3:$DR$4,2,0),DS8,\"\"))","v":10.5},{"$f":"IF(ROWS($DT$3:DT8)>(ROWS($DT$3:$DT$28)-COUNTBLANK($DT$3:$DT$28)),\"\",INDEX($DT$3:$DT$28,SMALL(IF($DT$3:$DT$28<>\"\",ROW($DT$3:$DT$28)-2),ROWS($DT$3:DT8))))","v":15},null,5,null,"za dostawkę",80,null,"za dostawkę",80,null,null,null,"za dostawkę",80,null,"za dostawkę",80,null,118,118.001,null,{"$f":"IF(OR(Wycena!$C$20<>\"-\",Wycena!$C$21<>\"-\",),EM8,\"\")","v":""},{"$f":"IF(ROWS($EP$3:EP8)>(ROWS($EP$3:$EP$8)-COUNTBLANK($EP$3:$EP$8)),\"\",INDEX($EP$3:$EP$8,SMALL(IF($EP$3:$EP$8<>\"\",ROW($EP$3:$EP$8)-2),ROWS($EP$3:EP8))))","v":""},null,244,244.001,null,{"$f":"IF(IF(Wycena!$C$22<>\"-\",ES8,\"\")<=Wycena!$C$18-Wycena!$C$27,ES8,\"\")","v":""},{"$f":"IF(ROWS($EV$3:EV8)>(ROWS($EV$3:$EV$8)-COUNTBLANK($EV$3:$EV$8)),\"\",INDEX($EV$3:$EV$8,SMALL(IF($EV$3:$EV$8<>\"\",ROW($EV$3:$EV$8)-2),ROWS($EV$3:EV8))))","v":""},null,null,null,null,null,null,null,"Mleczne",350,"Mleczne",{"$f":"IF(Wycena!$C$20=\"-\",\"\",FG8)","v":""},{"$f":"IF(ROWS($FH$3:FH8)>(ROWS($FH$3:$FH$14)-COUNTBLANK($FH$3:$FH$14)),\"\",INDEX($FH$3:$FH$14,SMALL(IF($FH$3:$FH$14<>\"\",ROW($FH$3:$FH$14)-2),ROWS($FH$3:FH8))))","v":""},"Mleczne",{"$f":"IF(Wycena!$C$21=\"-\",\"\",FJ8)","v":""},{"$f":"IF(ROWS($FK$3:FK8)>(ROWS($FK$3:$FK$14)-COUNTBLANK($FK$3:$FK$14)),\"\",INDEX($FK$3:$FK$14,SMALL(IF($FK$3:$FK$14<>\"\",ROW($FK$3:$FK$14)-2),ROWS($FK$3:FK8))))","v":""},null,null,5,{"$f":"IF(Wycena!$C$20=\"-\",\"\",FO8)","v":""},{"$f":"IF(ROWS($FP$3:FP8)>(ROWS($FP$3:$FP$23)-COUNTBLANK($FP$3:$FP$23)),\"\",INDEX($FP$3:$FP$23,SMALL(IF($FP$3:$FP$23<>\"\",ROW($FP$3:$FP$23)-2),ROWS($FP$3:FP8))))","v":""},{"$f":"IF(Wycena!$C$21=\"-\",\"\",FO8)","v":""},{"$f":"IF(ROWS($FR$3:FR8)>(ROWS($FR$3:$FR$23)-COUNTBLANK($FR$3:$FR$23)),\"\",INDEX($FR$3:$FR$23,SMALL(IF($FR$3:$FR$23<>\"\",ROW($FR$3:$FR$23)-2),ROWS($FR$3:FR8))))","v":""},{"$f":"IF(Wycena!$C$22=\"-\",\"\",FO8)","v":""},{"$f":"IF(ROWS($FT$3:FT8)>(ROWS($FT$3:$FT$23)-COUNTBLANK($FT$3:$FT$23)),\"\",INDEX($FT$3:$FT$23,SMALL(IF($FT$3:$FT$23<>\"\",ROW($FT$3:$FT$23)-2),ROWS($FT$3:FT8))))","v":""},"x","Zestaw czytnik linii papilarnych",5600,{"$f":"IFERROR(VLOOKUP(Wycena!C59,OFFSET(FW15,MATCH(Wycena!C59,FW15:FW39,0)+4,0,15,2),2,0),\"\")","v":"Automat 4-punktowy"},{"$f":"IF(ROWS($FY$3:FY8)>(ROWS($FY$3:$FY$10)-COUNTBLANK($FY$3:$FY$10)),\"\",INDEX($FY$3:$FY$10,SMALL(IF($FY$3:$FY$10<>\"\",ROW($FY$3:$FY$10)-2),ROWS($FY$3:FY8))))","v":"Automat 4-punktowy"},"Klamka AXA Haga Plus",250,"Klamka AXA Haga Plus","Klamka AXA Haga Plus",null,null,null,null,null,{"$f":"IF((HLOOKUP(VLOOKUP(Wycena!$C$59,Mapping!$GI$35:$GJ$43,2,0),$GD$1:$GI$33,2+GK8))=0,\"\",(HLOOKUP(VLOOKUP(Wycena!$C$59,Mapping!$GI$35:$GJ$43,2,0),$GD$1:$GI$33,2+GK8)))","v":"Klamka AXA Haga Plus"},6,{"$f":"IF(ROWS($GJ$3:GJ8)>(ROWS($GJ$3:$GJ$33)-COUNTBLANK($GJ$3:$GJ$33)),\"\",INDEX($GJ$3:$GJ$33,SMALL(IF($GJ$3:$GJ$33<>\"\",ROW($GJ$3:$GJ$33)-2),ROWS($GJ$3:GJ8))))","v":{"$error":"#N/A"}},"Klamka Medos Dublin","Czarny",null,null,{"$f":"IFERROR(IF(FIND(\"Antaba M\",Wycena!$C$61)>0,170,\"\"),\"\")","v":""},{"$f":"IF(ROWS($GQ$3:GQ8)>(ROWS($GQ$3:$GQ$9)-COUNTBLANK($GQ$3:$GQ$9)),\"\",INDEX($GQ$3:$GQ$9,SMALL(IF($GQ$3:$GQ$9<>\"\",ROW($GQ$3:$GQ$9)-2),ROWS($GQ$3:GQ8))))","v":""},"Klasy C czarna",{"$f":"550-IF(Wycena!C59=Mapping!FY31,450,0)","v":550},{"$f":"IF(Wycena!$C$59=Mapping!FW6,\"-\",IF(Wycena!$C$59=Mapping!FW7,GS8,GS8))","v":"Klasy C czarna"},{"$f":"IF(ROWS($GU$3:GU8)>(ROWS($GU$3:$GU$8)-COUNTBLANK($GU$3:$GU$8)),\"\",INDEX($GU$3:$GU$8,SMALL(IF($GU$3:$GU$8<>\"\",ROW($GU$3:$GU$8)-2),ROWS($GU$3:GU8))))","v":"Klasy C czarna"},null,null,null,null,{"$f":"$HA$3:INDEX($HA$3:$HA$5,(ROWS($GZ$3:$GZ$5)-COUNTBLANK($GZ$3:$GZ$5)))","v":"-"},null,null,null,null,"W skrzydle, dostawce i naświetlu",1200,{"$f":"IF(Wycena!$C$59=Mapping!$HB$31,-400,0)+HG8","v":1200},{"$f":"IF(Wycena!$C$6=\"Brak (pełne)\",\"\",HF8)","v":"W skrzydle, dostawce i naświetlu"},{"$f":"IF(OR(AND(Wycena!$C$20=\"-\",Wycena!$C$21<>\"-\",Wycena!C22<>\"-\"),AND(Wycena!$C$21=\"-\",Wycena!$C$20<>\"-\",Wycena!C22<>\"-\")),HI8,\"\")","v":""},{"$f":"IF(ROWS($HJ$3:HJ8)>(ROWS($HJ$3:$HJ$13)-COUNTBLANK($HJ$3:$HJ$13)),\"\",INDEX($HJ$3:$HJ$13,SMALL(IF($HJ$3:$HJ$13<>\"\",ROW($HJ$3:$HJ$13)-2),ROWS($HJ$3:HJ8))))","v":""},null,null,null,null,null,{"$f":"$HQ$3:INDEX($HQ$3:$HQ$5,(ROWS($HP$3:$HP$5)-COUNTBLANK($HP$3:$HP$5)))","v":"Aluminiowy (standard)"},null,13,170,{"$f":"(1+IFERROR(VLOOKUP(Wycena!$C$45,Mapping!$EZ$3:$FC$6,4,1),0)+IFERROR(VLOOKUP(Wycena!$C$49,Mapping!$EZ$3:$FC$6,4,1),0))*HT8","v":170},null,"Z dwóch stron skrzydła i dostawki",200,{"$f":"(1+IFERROR(VLOOKUP(Wycena!$C$45,Mapping!$EZ$3:$FC$6,4,1),0)+IFERROR(VLOOKUP(Wycena!$C$49,Mapping!$EZ$3:$FC$6,4,1),0))*HX8","v":200},400,{"$f":"(1+IFERROR(VLOOKUP(Wycena!$C$45,Mapping!$EZ$3:$FC$6,4,1),0)+IFERROR(VLOOKUP(Wycena!$C$49,Mapping!$EZ$3:$FC$6,4,1),0))*HZ8","v":400},{"$f":"IF(OR(AND(Wycena!$C$20=\"-\",Wycena!$C$21<>\"-\"),AND(Wycena!$C$21=\"-\",Wycena!$C$20<>\"-\")),HW8,\"\")","v":""},{"$f":"IF(ROWS($IB$3:IB8)>(ROWS($IB$3:$IB$9)-COUNTBLANK($IB$3:$IB$9)),\"\",INDEX($IB$3:$IB$9,SMALL(IF($IB$3:$IB$9<>\"\",ROW($IB$3:$IB$9)-2),ROWS($IB$3:IB8))))","v":""},null,null,null,null,"Nawierzchniowy z funkcją stop inox",500,null,null,null,null,null,null,null,null,null,null,null,null,null,0.05,null,600,null,null,null,"Bezprzylgowe Glass","czarny"]
["DB 11",20,20,20,20,34,34,36,36,null,null,null,{"$f":"IFERROR(VLOOKUP(Wycena!$C$5,OFFSET(SKU!$B$1,MATCH(Wycena!$C$5,SKU!$B$1:$B$743,0)+5,0,1000,6),5,0),\"\")","v":""},{"$f":"IFERROR(VLOOKUP(Wycena!$C$5,OFFSET(SKU!$B$1,MATCH(Wycena!$C$5,SKU!$B$1:$B$743,0)+5,0,1000,6),2,0)-VLOOKUP(Wycena!$C$5,SKU!$B$1:$C$743,2,0),\"\")","v":""},{"$f":"IF(ROWS($M$3:M9)>(ROWS($M$3:$M$10)-COUNTBLANK($M$3:$M$10)),\"\",INDEX($M$3:$M$10,SMALL(IF($M$3:$M$10<>\"\",ROW($M$3:$M$10)-2),ROWS($M$3:M9))))","v":""},null,"x","x","x","x",null,null,null,null,"Mahoń",0,"Mahoń",{"$f":"IF((VLOOKUP(Wycena!$C$7,Mapping!$Q$15:$R$20,2,0))=\"tak\",\"\",AA9)","v":"Mahoń"},{"$f":"IF(ROWS($AB$3:AB9)>(ROWS($AB$3:$AB$229)-COUNTBLANK($AB$3:$AB$229)),\"\",INDEX($AB$3:$AB$229,SMALL(IF($AB$3:$AB$229<>\"\",ROW($AB$3:$AB$229)-2),ROWS($AB$3:AB9))))","v":{"$error":"#N/A"}},null,null,null,null,null,null,null,null,null,null,null,null,null,null,null,null,null,null,null,null,78,0,0,{"$f":"IF(Wycena!$C$16=78,Mapping!AY9,AZ9)","v":0},null,null,186,0,0,{"$f":"IF(Wycena!$C$16=78,Mapping!BE9,BF9)","v":0},null,null,null,null,null,{"$f":"$BM$3:INDEX($BM$3:$BM$6,(ROWS($BL$3:$BL$6)-COUNTBLANK($BL$3:$BL$6)))","v":"Lewe na zewnątrz"},null,"x","x","x","x","x",null,null,null,null,null,null,{"$f":"$BZ$3:INDEX($BZ$3:$BZ$6,(ROWS($BY$3:$BY$6)-COUNTBLANK($BY$3:$BY$6)))","v":"-"},"Dyskretne brąz refleks",400,{"$f":"CB9*(1+IFERROR(VLOOKUP(Wycena!$C$45,Mapping!$EZ$3:$FC$6,4,1),0)+IFERROR(VLOOKUP(Wycena!$C$49,Mapping!$EZ$3:$FC$6,4,1),0))*(1+VLOOKUP(Wycena!$C$54,Mapping!$BW$3:$BX$6,2,1))","v":{"$error":"#N/A"}},"Piaskowane refleks",{"$f":"IF(Wycena!$C$22=\"-\",\"\",CD9)","v":""},{"$f":"IF(ROWS($CE$3:CE9)>(ROWS($CE$3:$CE$13)-COUNTBLANK($CE$3:$CE$13)),\"\",INDEX($CE$3:$CE$13,SMALL(IF($CE$3:$CE$13<>\"\",ROW($CE$3:$CE$13)-2),ROWS($CE$3:CE9))))","v":""},null,null,null,null,null,null,null,null,"Przy skrzydle i naświetlu z dwóch stron",1600,{"$f":"IF(Wycena!$C$25=\"Krosnowa\",\"\",CO9)","v":"Przy skrzydle i naświetlu z dwóch stron"},{"$f":"IF(Wycena!$C$14=\"Bezprzylgowe Glass\",\"\",CQ9)","v":"Przy skrzydle i naświetlu z dwóch stron"},{"$f":"CR9","v":"Przy skrzydle i naświetlu z dwóch stron"},{"$f":"IF(Wycena!$C$22=\"W ościeżnicy\",CS9,\"\")","v":""},{"$f":"IF(ROWS($CT$3:CT9)>(ROWS($CT$3:$CT$11)-COUNTBLANK($CT$3:$CT$11)),\"\",INDEX($CT$3:$CT$11,SMALL(IF($CT$3:$CT$11<>\"\",ROW($CT$3:$CT$11)-2),ROWS($CT$3:CT9))))","v":""},null,null,null,"Bezprzylgowe",8,11,{"$f":"IF(DA9>=VLOOKUP(Wycena!$C$14,Mapping!$CY$3:$CZ$5,2,0),DA9,\"\")","v":11},{"$f":"IF(ROWS($DB$3:DB9)>(ROWS($DB$3:$DB$28)-COUNTBLANK($DB$3:$DB$28)),\"\",INDEX($DB$3:$DB$28,SMALL(IF($DB$3:$DB$28<>\"\",ROW($DB$3:$DB$28)-2),ROWS($DB$3:DB9))))","v":12},null,null,null,"Bezprzylgowe",{"$f":"DH4","v":8},{"$f":"DI4","v":8},null,11,{"$f":"IF(DK9>=VLOOKUP(Wycena!$C$14,Mapping!$DG$3:$DH$5,2,0),DK9,\"\")","v":11},{"$f":"IF(ROWS($DL$3:DL9)>(ROWS($DL$3:$DL$28)-COUNTBLANK($DL$3:$DL$28)),\"\",INDEX($DL$3:$DL$28,SMALL(IF($DL$3:$DL$28<>\"\",ROW($DL$3:$DL$28)-2),ROWS($DL$3:DL9))))","v":12},{"$f":"IF(DK9>=VLOOKUP(Wycena!$C$14,Mapping!$DG$3:$DI$5,3,0),DK9,\"\")","v":11},{"$f":"IF(ROWS($DN$3:DN9)>(ROWS($DN$3:$DN$28)-COUNTBLANK($DN$3:$DN$28)),\"\",INDEX($DN$3:$DN$28,SMALL(IF($DN$3:$DN$28<>\"\",ROW($DN$3:$DN$28)-2),ROWS($DN$3:DN9))))","v":12},null,"krosnowa",6,11,{"$f":"IF(DS9>=VLOOKUP(Wycena!$C$25,Mapping!$DQ$3:$DR$4,2,0),DS9,\"\")","v":11},{"$f":"IF(ROWS($DT$3:DT9)>(ROWS($DT$3:$DT$28)-COUNTBLANK($DT$3:$DT$28)),\"\",INDEX($DT$3:$DT$28,SMALL(IF($DT$3:$DT$28<>\"\",ROW($DT$3:$DT$28)-2),ROWS($DT$3:DT9))))","v":16},null,6,null,"za wysokość ponad standard ",80,null,"za wysokość ponad standard ",80,null,null,null,"za wysokość ponad standard ",80,null,"za wysokość ponad standard ",80,null,"x","x","x","x","x",null,"x","x","x","x","x",null,null,null,null,null,null,null,"Piaskowane refleks",350,"Piaskowane refleks",{"$f":"IF(Wycena!$C$20=\"-\",\"\",FG9)","v":""},{"$f":"IF(ROWS($FH$3:FH9)>(ROWS($FH$3:$FH$14)-COUNTBLANK($FH$3:$FH$14)),\"\",INDEX($FH$3:$FH$14,SMALL(IF($FH$3:$FH$14<>\"\",ROW($FH$3:$FH$14)-2),ROWS($FH$3:FH9))))","v":""},"Piaskowane refleks",{"$f":"IF(Wycena!$C$21=\"-\",\"\",FJ9)","v":""},{"$f":"IF(ROWS($FK$3:FK9)>(ROWS($FK$3:$FK$14)-COUNTBLANK($FK$3:$FK$14)),\"\",INDEX($FK$3:$FK$14,SMALL(IF($FK$3:$FK$14<>\"\",ROW($FK$3:$FK$14)-2),ROWS($FK$3:FK9))))","v":""},null,null,6,{"$f":"IF(Wycena!$C$20=\"-\",\"\",FO9)","v":""},{"$f":"IF(ROWS($FP$3:FP9)>(ROWS($FP$3:$FP$23)-COUNTBLANK($FP$3:$FP$23)),\"\",INDEX($FP$3:$FP$23,SMALL(IF($FP$3:$FP$23<>\"\",ROW($FP$3:$FP$23)-2),ROWS($FP$3:FP9))))","v":""},{"$f":"IF(Wycena!$C$21=\"-\",\"\",FO9)","v":""},{"$f":"IF(ROWS($FR$3:FR9)>(ROWS($FR$3:$FR$23)-COUNTBLANK($FR$3:$FR$23)),\"\",INDEX($FR$3:$FR$23,SMALL(IF($FR$3:$FR$23<>\"\",ROW($FR$3:$FR$23)-2),ROWS($FR$3:FR9))))","v":""},{"$f":"IF(Wycena!$C$22=\"-\",\"\",FO9)","v":""},{"$f":"IF(ROWS($FT$3:FT9)>(ROWS($FT$3:$FT$23)-COUNTBLANK($FT$3:$FT$23)),\"\",INDEX($FT$3:$FT$23,SMALL(IF($FT$3:$FT$23<>\"\",ROW($FT$3:$FT$23)-2),ROWS($FT$3:FT9))))","v":""},"x","Zestaw czytnik linii papilarnych dLine",6200,{"$f":"IFERROR(VLOOKUP(Wycena!C59,OFFSET(FW15,MATCH(Wycena!C59,FW15:FW39,0)+5,0,15,2),2,0),\"\")","v":"Automat ADR 5-punktowy z gałką"},{"$f":"IF(ROWS($FY$3:FY9)>(ROWS($FY$3:$FY$10)-COUNTBLANK($FY$3:$FY$10)),\"\",INDEX($FY$3:$FY$10,SMALL(IF($FY$3:$FY$10<>\"\",ROW($FY$3:$FY$10)-2),ROWS($FY$3:FY9))))","v":"Automat ADR 5-punktowy z gałką"},"Klamka AXA Manitoba Plus",250,"Klamka AXA Manitoba Plus","Klamka AXA Manitoba Plus",null,null,null,null,null,{"$f":"IF((HLOOKUP(VLOOKUP(Wycena!$C$59,Mapping!$GI$35:$GJ$43,2,0),$GD$1:$GI$33,2+GK9))=0,\"\",(HLOOKUP(VLOOKUP(Wycena!$C$59,Mapping!$GI$35:$GJ$43,2,0),$GD$1:$GI$33,2+GK9)))","v":"Klamka AXA Manitoba Plus"},7,{"$f":"IF(ROWS($GJ$3:GJ9)>(ROWS($GJ$3:$GJ$33)-COUNTBLANK($GJ$3:$GJ$33)),\"\",INDEX($GJ$3:$GJ$33,SMALL(IF($GJ$3:$GJ$33<>\"\",ROW($GJ$3:$GJ$33)-2),ROWS($GJ$3:GJ9))))","v":{"$error":"#N/A"}},"Klamka Barański Retro","Satyna",null,{"$f":"$GP$3:INDEX($GP$3:$GP$6,(ROWS($GO$3:$GO$6)-COUNTBLANK($GO$3:$GO$6)))","v":""},{"$f":"IFERROR(IF(FIND(\"Vegas\",Wycena!$C$61)>0,200,\"\"),\"\")","v":""},{"$f":"IF(ROWS($GQ$3:GQ9)>(ROWS($GQ$3:$GQ$9)-COUNTBLANK($GQ$3:$GQ$9)),\"\",INDEX($GQ$3:$GQ$9,SMALL(IF($GQ$3:$GQ$9<>\"\",ROW($GQ$3:$GQ$9)-2),ROWS($GQ$3:GQ9))))","v":""},null,null,"x","x",null,null,null,null,null,null,null,null,null,"W skrzydle, dostawkach i naświetlu",1600,{"$f":"IF(Wycena!$C$59=Mapping!$HB$31,-400,0)+HG9","v":1600},{"$f":"IF(Wycena!$C$6=\"Brak (pełne)\",\"\",HF9)","v":"W skrzydle, dostawkach i naświetlu"},{"$f":"IF(AND(Wycena!$C$20<>\"-\",Wycena!$C$21<>\"-\",Wycena!$C$22<>\"-\"),HI9,\"\")","v":""},{"$f":"IF(ROWS($HJ$3:HJ9)>(ROWS($HJ$3:$HJ$13)-COUNTBLANK($HJ$3:$HJ$13)),\"\",INDEX($HJ$3:$HJ$13,SMALL(IF($HJ$3:$HJ$13<>\"\",ROW($HJ$3:$HJ$13)-2),ROWS($HJ$3:HJ9))))","v":""},null,null,null,null,null,null,null,15,180,{"$f":"(1+IFERROR(VLOOKUP(Wycena!$C$45,Mapping!$EZ$3:$FC$6,4,1),0)+IFERROR(VLOOKUP(Wycena!$C$49,Mapping!$EZ$3:$FC$6,4,1),0))*HT9","v":180},null,"Z dwóch stron skrzydła i dostawek",200,{"$f":"(1+IFERROR(VLOOKUP(Wycena!$C$45,Mapping!$EZ$3:$FC$6,4,1),0)+IFERROR(VLOOKUP(Wycena!$C$49,Mapping!$EZ$3:$FC$6,4,1),0))*HX9","v":200},400,{"$f":"(1+IFERROR(VLOOKUP(Wycena!$C$45,Mapping!$EZ$3:$FC$6,4,1),0)+IFERROR(VLOOKUP(Wycena!$C$49,Mapping!$EZ$3:$FC$6,4,1),0))*HZ9","v":400},{"$f":"IF(AND(Wycena!$C$20<>\"-\",Wycena!$C$21<>\"-\"),HW9,\"\")","v":""},{"$f":"IF(ROWS($IB$3:IB9)>(ROWS($IB$3:$IB$9)-COUNTBLANK($IB$3:$IB$9)),\"\",INDEX($IB$3:$IB$9,SMALL(IF($IB$3:$IB$9<>\"\",ROW($IB$3:$IB$9)-2),ROWS($IB$3:IB9))))","v":""},null,null,null,null,"Nawierzchniowy z funkcją stop biały",500,null,null,null,null,null,null,null,null,null,null,null,null,null,0.06,null,700]
["DB 12",20,20,20,20,34,34,36,36,"Mapping dla naświetle",3,null,{"$f":"IFERROR(VLOOKUP(Wycena!$C$5,OFFSET(SKU!$B$1,MATCH(Wycena!$C$5,SKU!$B$1:$B$743,0)+6,0,1000,6),5,0),\"\")","v":""},{"$f":"IFERROR(VLOOKUP(Wycena!$C$5,OFFSET(SKU!$B$1,MATCH(Wycena!$C$5,SKU!$B$1:$B$743,0)+6,0,1000,6),2,0)-VLOOKUP(Wycena!$C$5,SKU!$B$1:$C$743,2,0),\"\")","v":""},{"$f":"IF(ROWS($M$3:M10)>(ROWS($M$3:$M$10)-COUNTBLANK($M$3:$M$10)),\"\",INDEX($M$3:$M$10,SMALL(IF($M$3:$M$10<>\"\",ROW($M$3:$M$10)-2),ROWS($M$3:M10))))","v":""},null,null,null,null,null,null,null,null,null,"Montana",null,"Montana",{"$f":"AA10","v":"Montana"},{"$f":"IF(ROWS($AB$3:AB10)>(ROWS($AB$3:$AB$229)-COUNTBLANK($AB$3:$AB$229)),\"\",INDEX($AB$3:$AB$229,SMALL(IF($AB$3:$AB$229<>\"\",ROW($AB$3:$AB$229)-2),ROWS($AB$3:AB10))))","v":{"$error":"#N/A"}},null,null,null,null,null,null,null,{"$f":"$AK$3:INDEX($AK$3:$AK$7,(ROWS($AI$3:$AI$7)-COUNTBLANK($AI$3:$AI$7)))","v":{"$error":"#N/A"}},null,null,null,null,null,null,null,null,null,null,null,null,79,0,0,{"$f":"IF(Wycena!$C$16=78,Mapping!AY10,AZ10)","v":0},null,null,187,0,0,{"$f":"IF(Wycena!$C$16=78,Mapping!BE10,BF10)","v":0},null,null,null,null,null,null,null,null,null,null,null,{"$f":"$BS$3:INDEX($BS$3:$BS$8,(ROWS($BR$3:$BR$8)-COUNTBLANK($BR$3:$BR$8)))","v":{"$error":"#N/A"}},null,null,null,null,null,null,null,"Dyskretne grafit refleks",400,{"$f":"CB10*(1+IFERROR(VLOOKUP(Wycena!$C$45,Mapping!$EZ$3:$FC$6,4,1),0)+IFERROR(VLOOKUP(Wycena!$C$49,Mapping!$EZ$3:$FC$6,4,1),0))*(1+VLOOKUP(Wycena!$C$54,Mapping!$BW$3:$BX$6,2,1))","v":{"$error":"#N/A"}},{"$f":"IF(Wycena!$C$22=\"Imitacja skrzydła\",CA9,\"\")","v":""},{"$f":"IF(Wycena!$C$22=\"-\",\"\",CD10)","v":""},{"$f":"IF(ROWS($CE$3:CE10)>(ROWS($CE$3:$CE$13)-COUNTBLANK($CE$3:$CE$13)),\"\",INDEX($CE$3:$CE$13,SMALL(IF($CE$3:$CE$13<>\"\",ROW($CE$3:$CE$13)-2),ROWS($CE$3:CE10))))","v":""},null,null,null,null,null,null,null,null,"Przy skrzydle, naświetlu i ościeżnicy od zewnątrz",{"$f":"1200+((IF(OR(Wycena!$C$20=\"W ościeżnicy nowoczesna\",Wycena!$C$20=\"W ościeżnicy tradycyjna\"),1,0))+(IF(OR(Wycena!$C$21=\"W ościeżnicy nowoczesna\",Wycena!$C$21=\"W ościeżnicy tradycyjna\"),1,0)))*600","v":1200},{"$f":"IF(Wycena!$C$25=\"Krosnowa\",\"\",CO10)","v":"Przy skrzydle, naświetlu i ościeżnicy od zewnątrz"},{"$f":"IF(Wycena!$C$14=\"Bezprzylgowe Glass\",\"\",CQ10)","v":"Przy skrzydle, naświetlu i ościeżnicy od zewnątrz"},{"$f":"IF(OR(Wycena!$C$20=\"W ościeżnicy nowoczesna\",Wycena!$C$20=\"W ościeżnicy tradycyjna\",Wycena!$C$21=\"W ościeżnicy nowoczesna\",Wycena!$C$21=\"W ościeżnicy tradycyjna\"),CR10,\"\")","v":""},{"$f":"IF(Wycena!$C$22=\"W ościeżnicy\",CS10,\"\")","v":""},{"$f":"IF(ROWS($CT$3:CT10)>(ROWS($CT$3:$CT$11)-COUNTBLANK($CT$3:$CT$11)),\"\",INDEX($CT$3:$CT$11,SMALL(IF($CT$3:$CT$11<>\"\",ROW($CT$3:$CT$11)-2),ROWS($CT$3:CT10))))","v":""},null,null,null,"Bezprzylgowe Glass",8,12,{"$f":"IF(DA10>=VLOOKUP(Wycena!$C$14,Mapping!$CY$3:$CZ$5,2,0),DA10,\"\")","v":12},{"$f":"IF(ROWS($DB$3:DB10)>(ROWS($DB$3:$DB$28)-COUNTBLANK($DB$3:$DB$28)),\"\",INDEX($DB$3:$DB$28,SMALL(IF($DB$3:$DB$28<>\"\",ROW($DB$3:$DB$28)-2),ROWS($DB$3:DB10))))","v":13},null,null,null,"Bezprzylgowe Glass",8,8,null,12,{"$f":"IF(DK10>=VLOOKUP(Wycena!$C$14,Mapping!$DG$3:$DH$5,2,0),DK10,\"\")","v":12},{"$f":"IF(ROWS($DL$3:DL10)>(ROWS($DL$3:$DL$28)-COUNTBLANK($DL$3:$DL$28)),\"\",INDEX($DL$3:$DL$28,SMALL(IF($DL$3:$DL$28<>\"\",ROW($DL$3:$DL$28)-2),ROWS($DL$3:DL10))))","v":13},{"$f":"IF(DK10>=VLOOKUP(Wycena!$C$14,Mapping!$DG$3:$DI$5,3,0),DK10,\"\")","v":12},{"$f":"IF(ROWS($DN$3:DN10)>(ROWS($DN$3:$DN$28)-COUNTBLANK($DN$3:$DN$28)),\"\",INDEX($DN$3:$DN$28,SMALL(IF($DN$3:$DN$28<>\"\",ROW($DN$3:$DN$28)-2),ROWS($DN$3:DN10))))","v":13},null,null,null,12,{"$f":"IF(DS10>=VLOOKUP(Wycena!$C$25,Mapping!$DQ$3:$DR$4,2,0),DS10,\"\")","v":12},{"$f":"IF(ROWS($DT$3:DT10)>(ROWS($DT$3:$DT$28)-COUNTBLANK($DT$3:$DT$28)),\"\",INDEX($DT$3:$DT$28,SMALL(IF($DT$3:$DT$28<>\"\",ROW($DT$3:$DT$28)-2),ROWS($DT$3:DT10))))","v":17},null,7,null,null,null,null,null,null,null,null,null,null,null,null,null,null,null,null,null,null,null,null,null,null,null,null,null,null,null,null,null,null,null,null,null,"Dyskretne brąz refleks",600,{"$f":"IF(OR(Wycena!$C$20=\"Imitacja skrzydła stała\",Wycena!$C$20=\"Imitacja skrzydła ruchoma\"),FE10,\"\")","v":""},{"$f":"IF(Wycena!$C$20=\"-\",\"\",FG10)","v":""},{"$f":"IF(ROWS($FH$3:FH10)>(ROWS($FH$3:$FH$14)-COUNTBLANK($FH$3:$FH$14)),\"\",INDEX($FH$3:$FH$14,SMALL(IF($FH$3:$FH$14<>\"\",ROW($FH$3:$FH$14)-2),ROWS($FH$3:FH10))))","v":""},{"$f":"IF(OR(Wycena!$C$21=\"Imitacja skrzydła stała\",Wycena!$C$21=\"Imitacja skrzydła ruchoma\"),FE10,\"\")","v":""},{"$f":"IF(Wycena!$C$21=\"-\",\"\",FJ10)","v":""},{"$f":"IF(ROWS($FK$3:FK10)>(ROWS($FK$3:$FK$14)-COUNTBLANK($FK$3:$FK$14)),\"\",INDEX($FK$3:$FK$14,SMALL(IF($FK$3:$FK$14<>\"\",ROW($FK$3:$FK$14)-2),ROWS($FK$3:FK10))))","v":""},null,null,7,{"$f":"IF(Wycena!$C$20=\"-\",\"\",FO10)","v":""},{"$f":"IF(ROWS($FP$3:FP10)>(ROWS($FP$3:$FP$23)-COUNTBLANK($FP$3:$FP$23)),\"\",INDEX($FP$3:$FP$23,SMALL(IF($FP$3:$FP$23<>\"\",ROW($FP$3:$FP$23)-2),ROWS($FP$3:FP10))))","v":""},{"$f":"IF(Wycena!$C$21=\"-\",\"\",FO10)","v":""},{"$f":"IF(ROWS($FR$3:FR10)>(ROWS($FR$3:$FR$23)-COUNTBLANK($FR$3:$FR$23)),\"\",INDEX($FR$3:$FR$23,SMALL(IF($FR$3:$FR$23<>\"\",ROW($FR$3:$FR$23)-2),ROWS($FR$3:FR10))))","v":""},{"$f":"IF(Wycena!$C$22=\"-\",\"\",FO10)","v":""},{"$f":"IF(ROWS($FT$3:FT10)>(ROWS($FT$3:$FT$23)-COUNTBLANK($FT$3:$FT$23)),\"\",INDEX($FT$3:$FT$23,SMALL(IF($FT$3:$FT$23<>\"\",ROW($FT$3:$FT$23)-2),ROWS($FT$3:FT10))))","v":""},"x","Zestaw UNILOCK",5900,{"$f":"IFERROR(VLOOKUP(Wycena!C59,OFFSET(FW15,MATCH(Wycena!C59,FW15:FW39,0)+6,0,15,2),2,0),\"\")","v":"Automat ADR 5-punktowy bez gałki"},{"$f":"IF(ROWS($FY$3:FY10)>(ROWS($FY$3:$FY$10)-COUNTBLANK($FY$3:$FY$10)),\"\",INDEX($FY$3:$FY$10,SMALL(IF($FY$3:$FY$10<>\"\",ROW($FY$3:$FY$10)-2),ROWS($FY$3:FY10))))","v":"Automat ADR 5-punktowy bez gałki"},"Klamka AXA Niagara Plus",250,"Klamka AXA Niagara Plus","Klamka AXA Niagara Plus",null,null,null,null,null,{"$f":"IF((HLOOKUP(VLOOKUP(Wycena!$C$59,Mapping!$GI$35:$GJ$43,2,0),$GD$1:$GI$33,2+GK10))=0,\"\",(HLOOKUP(VLOOKUP(Wycena!$C$59,Mapping!$GI$35:$GJ$43,2,0),$GD$1:$GI$33,2+GK10)))","v":"Klamka AXA Niagara Plus"},8,{"$f":"IF(ROWS($GJ$3:GJ10)>(ROWS($GJ$3:$GJ$33)-COUNTBLANK($GJ$3:$GJ$33)),\"\",INDEX($GJ$3:$GJ$33,SMALL(IF($GJ$3:$GJ$33<>\"\",ROW($GJ$3:$GJ$33)-2),ROWS($GJ$3:GJ10))))","v":{"$error":"#N/A"}},"Klamka Barański Retro","Patyna",null,null,"x","x",null,null,null,null,null,null,null,null,null,null,null,null,null,"W dostawce",400,400,"W dostawce",{"$f":"IF(OR(AND(Wycena!$C$20=\"-\",Wycena!$C$21<>\"-\"),AND(Wycena!$C$21=\"-\",Wycena!$C$20<>\"-\")),HI10,\"\")","v":""},{"$f":"IF(ROWS($HJ$3:HJ10)>(ROWS($HJ$3:$HJ$13)-COUNTBLANK($HJ$3:$HJ$13)),\"\",INDEX($HJ$3:$HJ$13,SMALL(IF($HJ$3:$HJ$13<>\"\",ROW($HJ$3:$HJ$13)-2),ROWS($HJ$3:HJ10))))","v":""},null,"Lewe na zewnątrz",1,null,null,null,null,16,{"$f":"120+110","v":230},{"$f":"(1+IFERROR(VLOOKUP(Wycena!$C$45,Mapping!$EZ$3:$FC$6,4,1),0)+IFERROR(VLOOKUP(Wycena!$C$49,Mapping!$EZ$3:$FC$6,4,1),0))*HT10","v":230},null,"x","x","x","x","x","x","x",null,null,null,null,"Nawierzchniowy z funkcją stop brąz",500,null,null,null,null,null,null,null,null,null,null,null,null,null,7.0000000000000007E-2,null,800]
["DB 14",20,20,20,20,34,34,36,36,"W ościeżnicy",5,null,"x","x","x",null,null,null,null,{"$f":"$T$3:INDEX($T$3:$T$8,(ROWS($S$3:$S$8)-COUNTBLANK($S$3:$S$8)))","v":{"$error":"#N/A"}},null,null,null,null,"Orzech",0,{"$f":"Y11","v":"Orzech"},{"$f":"IF((VLOOKUP(Wycena!$C$7,Mapping!$Q$15:$R$20,2,0))=\"tak\",\"\",AA11)","v":"Orzech"},{"$f":"IF(ROWS($AB$3:AB11)>(ROWS($AB$3:$AB$229)-COUNTBLANK($AB$3:$AB$229)),\"\",INDEX($AB$3:$AB$229,SMALL(IF($AB$3:$AB$229<>\"\",ROW($AB$3:$AB$229)-2),ROWS($AB$3:AB11))))","v":{"$error":"#N/A"}},null,null,null,null,null,null,null,null,null,null,null,null,null,null,null,null,null,null,null,null,80,0,0,{"$f":"IF(Wycena!$C$16=78,Mapping!AY11,AZ11)","v":0},null,null,188,0,0,{"$f":"IF(Wycena!$C$16=78,Mapping!BE11,BF11)","v":0},null,null,null,null,null,null,null,null,null,null,null,{"$error":"#N/A"},null,null,null,null,null,null,null,"Dyskretne lustrzane",400,{"$f":"CB11*(1+IFERROR(VLOOKUP(Wycena!$C$45,Mapping!$EZ$3:$FC$6,4,1),0)+IFERROR(VLOOKUP(Wycena!$C$49,Mapping!$EZ$3:$FC$6,4,1),0))*(1+VLOOKUP(Wycena!$C$54,Mapping!$BW$3:$BX$6,2,1))","v":{"$error":"#N/A"}},{"$f":"IF(Wycena!$C$22=\"Imitacja skrzydła\",CA10,\"\")","v":""},{"$f":"IF(Wycena!$C$22=\"-\",\"\",CD11)","v":""},{"$f":"IF(ROWS($CE$3:CE11)>(ROWS($CE$3:$CE$13)-COUNTBLANK($CE$3:$CE$13)),\"\",INDEX($CE$3:$CE$13,SMALL(IF($CE$3:$CE$13<>\"\",ROW($CE$3:$CE$13)-2),ROWS($CE$3:CE11))))","v":""},null,null,null,null,null,null,null,null,"Przy skrzydle, naświetlu i ościeżnicy z dwóch stron",{"$f":"1600+((IF(OR(Wycena!$C$20=\"W ościeżnicy nowoczesna\",Wycena!$C$20=\"W ościeżnicy tradycyjna\"),1,0))+(IF(OR(Wycena!$C$21=\"W ościeżnicy nowoczesna\",Wycena!$C$21=\"W ościeżnicy tradycyjna\"),1,0)))*800","v":1600},{"$f":"IF(Wycena!$C$25=\"Krosnowa\",\"\",CO11)","v":"Przy skrzydle, naświetlu i ościeżnicy z dwóch stron"},{"$f":"IF(Wycena!$C$14=\"Bezprzylgowe Glass\",\"\",CQ11)","v":"Przy skrzydle, naświetlu i ościeżnicy z dwóch stron"},{"$f":"IF(OR(Wycena!$C$20=\"W ościeżnicy nowoczesna\",Wycena!$C$20=\"W ościeżnicy tradycyjna\",Wycena!$C$21=\"W ościeżnicy nowoczesna\",Wycena!$C$21=\"W ościeżnicy tradycyjna\"),CR11,\"\")","v":""},{"$f":"IF(Wycena!$C$22=\"W ościeżnicy\",CS11,\"\")","v":""},{"$f":"IF(ROWS($CT$3:CT11)>(ROWS($CT$3:$CT$11)-COUNTBLANK($CT$3:$CT$11)),\"\",INDEX($CT$3:$CT$11,SMALL(IF($CT$3:$CT$11<>\"\",ROW($CT$3:$CT$11)-2),ROWS($CT$3:CT11))))","v":""},null,null,null,null,null,13,{"$f":"IF(DA11>=VLOOKUP(Wycena!$C$14,Mapping!$CY$3:$CZ$5,2,0),DA11,\"\")","v":13},{"$f":"IF(ROWS($DB$3:DB11)>(ROWS($DB$3:$DB$28)-COUNTBLANK($DB$3:$DB$28)),\"\",INDEX($DB$3:$DB$28,SMALL(IF($DB$3:$DB$28<>\"\",ROW($DB$3:$DB$28)-2),ROWS($DB$3:DB11))))","v":14},null,null,null,null,null,null,null,13,{"$f":"IF(DK11>=VLOOKUP(Wycena!$C$14,Mapping!$DG$3:$DH$5,2,0),DK11,\"\")","v":13},{"$f":"IF(ROWS($DL$3:DL11)>(ROWS($DL$3:$DL$28)-COUNTBLANK($DL$3:$DL$28)),\"\",INDEX($DL$3:$DL$28,SMALL(IF($DL$3:$DL$28<>\"\",ROW($DL$3:$DL$28)-2),ROWS($DL$3:DL11))))","v":14},{"$f":"IF(DK11>=VLOOKUP(Wycena!$C$14,Mapping!$DG$3:$DI$5,3,0),DK11,\"\")","v":13},{"$f":"IF(ROWS($DN$3:DN11)>(ROWS($DN$3:$DN$28)-COUNTBLANK($DN$3:$DN$28)),\"\",INDEX($DN$3:$DN$28,SMALL(IF($DN$3:$DN$28<>\"\",ROW($DN$3:$DN$28)-2),ROWS($DN$3:DN11))))","v":14},null,null,null,13,{"$f":"IF(DS11>=VLOOKUP(Wycena!$C$25,Mapping!$DQ$3:$DR$4,2,0),DS11,\"\")","v":13},{"$f":"IF(ROWS($DT$3:DT11)>(ROWS($DT$3:$DT$28)-COUNTBLANK($DT$3:$DT$28)),\"\",INDEX($DT$3:$DT$28,SMALL(IF($DT$3:$DT$28<>\"\",ROW($DT$3:$DT$28)-2),ROWS($DT$3:DT11))))","v":18},null,8,null,null,null,null,null,null,null,null,null,null,null,null,null,null,null,null,null,null,null,{"$f":"$EQ$3:INDEX($EQ$3:$EQ$8,(ROWS($EP$3:$EP$8)-COUNTBLANK($EP$3:$EP$8)))","v":90},null,null,null,null,null,{"$f":"$EW$3:INDEX($EW$3:$EW$8,(ROWS($EV$3:$EV$8)-COUNTBLANK($EV$3:$EV$8)))","v":204},null,null,null,null,null,null,null,"Dyskretne grafit refleks",600,{"$f":"IF(OR(Wycena!$C$20=\"Imitacja skrzydła stała\",Wycena!$C$20=\"Imitacja skrzydła ruchoma\"),FE11,\"\")","v":""},{"$f":"IF(Wycena!$C$20=\"-\",\"\",FG11)","v":""},{"$f":"IF(ROWS($FH$3:FH11)>(ROWS($FH$3:$FH$14)-COUNTBLANK($FH$3:$FH$14)),\"\",INDEX($FH$3:$FH$14,SMALL(IF($FH$3:$FH$14<>\"\",ROW($FH$3:$FH$14)-2),ROWS($FH$3:FH11))))","v":""},{"$f":"IF(OR(Wycena!$C$21=\"Imitacja skrzydła stała\",Wycena!$C$21=\"Imitacja skrzydła ruchoma\"),FE11,\"\")","v":""},{"$f":"IF(Wycena!$C$21=\"-\",\"\",FJ11)","v":""},{"$f":"IF(ROWS($FK$3:FK11)>(ROWS($FK$3:$FK$14)-COUNTBLANK($FK$3:$FK$14)),\"\",INDEX($FK$3:$FK$14,SMALL(IF($FK$3:$FK$14<>\"\",ROW($FK$3:$FK$14)-2),ROWS($FK$3:FK11))))","v":""},null,null,8,{"$f":"IF(Wycena!$C$20=\"-\",\"\",FO11)","v":""},{"$f":"IF(ROWS($FP$3:FP11)>(ROWS($FP$3:$FP$23)-COUNTBLANK($FP$3:$FP$23)),\"\",INDEX($FP$3:$FP$23,SMALL(IF($FP$3:$FP$23<>\"\",ROW($FP$3:$FP$23)-2),ROWS($FP$3:FP11))))","v":""},{"$f":"IF(Wycena!$C$21=\"-\",\"\",FO11)","v":""},{"$f":"IF(ROWS($FR$3:FR11)>(ROWS($FR$3:$FR$23)-COUNTBLANK($FR$3:$FR$23)),\"\",INDEX($FR$3:$FR$23,SMALL(IF($FR$3:$FR$23<>\"\",ROW($FR$3:$FR$23)-2),ROWS($FR$3:FR11))))","v":""},{"$f":"IF(Wycena!$C$22=\"-\",\"\",FO11)","v":""},{"$f":"IF(ROWS($FT$3:FT11)>(ROWS($FT$3:$FT$23)-COUNTBLANK($FT$3:$FT$23)),\"\",INDEX($FT$3:$FT$23,SMALL(IF($FT$3:$FT$23<>\"\",ROW($FT$3:$FT$23)-2),ROWS($FT$3:FT11))))","v":""},null,"Zestaw UNILOCK WIFI",6500,"x","x","Klamka AXA Prestige Flex",500,"Klamka AXA Prestige Flex","Klamka AXA Prestige Flex",null,null,null,null,null,{"$f":"IF((HLOOKUP(VLOOKUP(Wycena!$C$59,Mapping!$GI$35:$GJ$43,2,0),$GD$1:$GI$33,2+GK11))=0,\"\",(HLOOKUP(VLOOKUP(Wycena!$C$59,Mapping!$GI$35:$GJ$43,2,0),$GD$1:$GI$33,2+GK11)))","v":"Klamka AXA Prestige Flex"},9,{"$f":"IF(ROWS($GJ$3:GJ11)>(ROWS($GJ$3:$GJ$33)-COUNTBLANK($GJ$3:$GJ$33)),\"\",INDEX($GJ$3:$GJ$33,SMALL(IF($GJ$3:$GJ$33<>\"\",ROW($GJ$3:$GJ$33)-2),ROWS($GJ$3:GJ11))))","v":{"$error":"#N/A"}},"Klamka Hoppe Bezpieczna","Satyna",null,null,null,null,null,null,null,{"$f":"$GV$3:INDEX($GV$3:$GV$8,(ROWS($GU$3:$GU$8)-COUNTBLANK($GU$3:$GU$8)))","v":"Standard satyna"},null,null,null,null,null,null,null,null,null,"W dostawkach",800,800,"W dostawkach",{"$f":"IF(AND(Wycena!$C$20<>\"-\",Wycena!$C$21<>\"-\"),HI11,\"\")","v":""},{"$f":"IF(ROWS($HJ$3:HJ11)>(ROWS($HJ$3:$HJ$13)-COUNTBLANK($HJ$3:$HJ$13)),\"\",INDEX($HJ$3:$HJ$13,SMALL(IF($HJ$3:$HJ$13<>\"\",ROW($HJ$3:$HJ$13)-2),ROWS($HJ$3:HJ11))))","v":""},null,"Lewe do wewnątrz",0,null,null,null,null,18,240,{"$f":"(1+IFERROR(VLOOKUP(Wycena!$C$45,Mapping!$EZ$3:$FC$6,4,1),0)+IFERROR(VLOOKUP(Wycena!$C$49,Mapping!$EZ$3:$FC$6,4,1),0))*HT11","v":240},null,null,null,null,null,null,null,null,null,null,null,null,"Nawierzchniowy z funkcją stop czarny",500,null,null,null,null,null,null,null,null,null,null,null,null,null,0.08,null,900]
["DB 17",20,20,20,20,34,34,36,36,"Imitacja skrzydła",3,null,null,null,null,null,null,null,null,null,null,null,null,null,"Palisander",0,"Palisander",{"$f":"IF((VLOOKUP(Wycena!$C$7,Mapping!$Q$15:$R$20,2,0))=\"tak\",\"\",AA12)","v":"Palisander"},{"$f":"IF(ROWS($AB$3:AB12)>(ROWS($AB$3:$AB$229)-COUNTBLANK($AB$3:$AB$229)),\"\",INDEX($AB$3:$AB$229,SMALL(IF($AB$3:$AB$229<>\"\",ROW($AB$3:$AB$229)-2),ROWS($AB$3:AB12))))","v":{"$error":"#N/A"}},null,null,null,null,null,null,null,null,null,null,null,null,null,null,null,null,null,null,null,null,81,0,0,{"$f":"IF(Wycena!$C$16=78,Mapping!AY12,AZ12)","v":0},null,null,189,0,0,{"$f":"IF(Wycena!$C$16=78,Mapping!BE12,BF12)","v":0},null,null,null,null,null,null,null,null,null,null,null,{"$error":"#N/A"},null,null,null,null,null,null,null,"Dyskretne lustro weneckie w głębi",400,{"$f":"CB12*(1+IFERROR(VLOOKUP(Wycena!$C$45,Mapping!$EZ$3:$FC$6,4,1),0)+IFERROR(VLOOKUP(Wycena!$C$49,Mapping!$EZ$3:$FC$6,4,1),0))*(1+VLOOKUP(Wycena!$C$54,Mapping!$BW$3:$BX$6,2,1))","v":{"$error":"#N/A"}},{"$f":"IF(Wycena!$C$22=\"Imitacja skrzydła\",CA11,\"\")","v":""},{"$f":"IF(Wycena!$C$22=\"-\",\"\",CD12)","v":""},{"$f":"IF(ROWS($CE$3:CE12)>(ROWS($CE$3:$CE$13)-COUNTBLANK($CE$3:$CE$13)),\"\",INDEX($CE$3:$CE$13,SMALL(IF($CE$3:$CE$13<>\"\",ROW($CE$3:$CE$13)-2),ROWS($CE$3:CE12))))","v":""},null,null,null,null,null,null,null,null,"x",null,null,"x","x","x","x",null,null,null,"vlookup ościeżnicy","stawki pod liczenie",14,{"$f":"IF(DA12>=VLOOKUP(Wycena!$C$14,Mapping!$CY$3:$CZ$5,2,0),DA12,\"\")","v":14},{"$f":"IF(ROWS($DB$3:DB12)>(ROWS($DB$3:$DB$28)-COUNTBLANK($DB$3:$DB$28)),\"\",INDEX($DB$3:$DB$28,SMALL(IF($DB$3:$DB$28<>\"\",ROW($DB$3:$DB$28)-2),ROWS($DB$3:DB12))))","v":15},null,null,null,"vlookup ościeżnicy","stawki pod liczenie","stawki pod liczenie",null,14,{"$f":"IF(DK12>=VLOOKUP(Wycena!$C$14,Mapping!$DG$3:$DH$5,2,0),DK12,\"\")","v":14},{"$f":"IF(ROWS($DL$3:DL12)>(ROWS($DL$3:$DL$28)-COUNTBLANK($DL$3:$DL$28)),\"\",INDEX($DL$3:$DL$28,SMALL(IF($DL$3:$DL$28<>\"\",ROW($DL$3:$DL$28)-2),ROWS($DL$3:DL12))))","v":15},{"$f":"IF(DK12>=VLOOKUP(Wycena!$C$14,Mapping!$DG$3:$DI$5,3,0),DK12,\"\")","v":14},{"$f":"IF(ROWS($DN$3:DN12)>(ROWS($DN$3:$DN$28)-COUNTBLANK($DN$3:$DN$28)),\"\",INDEX($DN$3:$DN$28,SMALL(IF($DN$3:$DN$28<>\"\",ROW($DN$3:$DN$28)-2),ROWS($DN$3:DN12))))","v":15},null,"vlookup rodzaj","stawki pod liczenie",14,{"$f":"IF(DS12>=VLOOKUP(Wycena!$C$25,Mapping!$DQ$3:$DR$4,2,0),DS12,\"\")","v":14},{"$f":"IF(ROWS($DT$3:DT12)>(ROWS($DT$3:$DT$28)-COUNTBLANK($DT$3:$DT$28)),\"\",INDEX($DT$3:$DT$28,SMALL(IF($DT$3:$DT$28<>\"\",ROW($DT$3:$DT$28)-2),ROWS($DT$3:DT12))))","v":19},null,9,null,null,null,null,null,null,null,null,null,null,null,null,null,null,null,null,null,null,null,null,null,null,null,null,null,null,null,null,null,null,null,null,null,"Dyskretne lustrzane",600,{"$f":"IF(OR(Wycena!$C$20=\"Imitacja skrzydła stała\",Wycena!$C$20=\"Imitacja skrzydła ruchoma\"),FE12,\"\")","v":""},{"$f":"IF(Wycena!$C$20=\"-\",\"\",FG12)","v":""},{"$f":"IF(ROWS($FH$3:FH12)>(ROWS($FH$3:$FH$14)-COUNTBLANK($FH$3:$FH$14)),\"\",INDEX($FH$3:$FH$14,SMALL(IF($FH$3:$FH$14<>\"\",ROW($FH$3:$FH$14)-2),ROWS($FH$3:FH12))))","v":""},{"$f":"IF(OR(Wycena!$C$21=\"Imitacja skrzydła stała\",Wycena!$C$21=\"Imitacja skrzydła ruchoma\"),FE12,\"\")","v":""},{"$f":"IF(Wycena!$C$21=\"-\",\"\",FJ12)","v":""},{"$f":"IF(ROWS($FK$3:FK12)>(ROWS($FK$3:$FK$14)-COUNTBLANK($FK$3:$FK$14)),\"\",INDEX($FK$3:$FK$14,SMALL(IF($FK$3:$FK$14<>\"\",ROW($FK$3:$FK$14)-2),ROWS($FK$3:FK12))))","v":""},null,null,9,{"$f":"IF(Wycena!$C$20=\"-\",\"\",FO12)","v":""},{"$f":"IF(ROWS($FP$3:FP12)>(ROWS($FP$3:$FP$23)-COUNTBLANK($FP$3:$FP$23)),\"\",INDEX($FP$3:$FP$23,SMALL(IF($FP$3:$FP$23<>\"\",ROW($FP$3:$FP$23)-2),ROWS($FP$3:FP12))))","v":""},{"$f":"IF(Wycena!$C$21=\"-\",\"\",FO12)","v":""},{"$f":"IF(ROWS($FR$3:FR12)>(ROWS($FR$3:$FR$23)-COUNTBLANK($FR$3:$FR$23)),\"\",INDEX($FR$3:$FR$23,SMALL(IF($FR$3:$FR$23<>\"\",ROW($FR$3:$FR$23)-2),ROWS($FR$3:FR12))))","v":""},{"$f":"IF(Wycena!$C$22=\"-\",\"\",FO12)","v":""},{"$f":"IF(ROWS($FT$3:FT12)>(ROWS($FT$3:$FT$23)-COUNTBLANK($FT$3:$FT$23)),\"\",INDEX($FT$3:$FT$23,SMALL(IF($FT$3:$FT$23<>\"\",ROW($FT$3:$FT$23)-2),ROWS($FT$3:FT12))))","v":""},null,null,null,null,null,"Klamka AXA Slim Plus",250,"Klamka AXA Slim Plus","Klamka AXA Slim Plus",null,null,null,null,null,{"$f":"IF((HLOOKUP(VLOOKUP(Wycena!$C$59,Mapping!$GI$35:$GJ$43,2,0),$GD$1:$GI$33,2+GK12))=0,\"\",(HLOOKUP(VLOOKUP(Wycena!$C$59,Mapping!$GI$35:$GJ$43,2,0),$GD$1:$GI$33,2+GK12)))","v":"Klamka AXA Slim Plus"},10,{"$f":"IF(ROWS($GJ$3:GJ12)>(ROWS($GJ$3:$GJ$33)-COUNTBLANK($GJ$3:$GJ$33)),\"\",INDEX($GJ$3:$GJ$33,SMALL(IF($GJ$3:$GJ$33<>\"\",ROW($GJ$3:$GJ$33)-2),ROWS($GJ$3:GJ12))))","v":{"$error":"#N/A"}},"Klamka Hoppe Bezpieczna","Patyna",null,null,null,{"$f":"$GR$3:INDEX($GR$3:$GR$9,(ROWS($GQ$3:$GQ$9)-COUNTBLANK($GQ$3:$GQ$9)))","v":"-"},null,null,null,null,null,null,null,null,null,null,null,null,null,"W dostawce i naświetlu",800,800,"W dostawce i naświetlu",{"$f":"IF(OR(AND(Wycena!$C$20=\"-\",Wycena!$C$21<>\"-\",Wycena!C22<>\"-\"),AND(Wycena!$C$21=\"-\",Wycena!$C$20<>\"-\",Wycena!C22<>\"-\")),HI12,\"\")","v":""},{"$f":"IF(ROWS($HJ$3:HJ12)>(ROWS($HJ$3:$HJ$13)-COUNTBLANK($HJ$3:$HJ$13)),\"\",INDEX($HJ$3:$HJ$13,SMALL(IF($HJ$3:$HJ$13<>\"\",ROW($HJ$3:$HJ$13)-2),ROWS($HJ$3:HJ12))))","v":""},null,"Prawe na zewnątrz",1,null,null,null,null,19,{"$f":"110+3*60","v":290},{"$f":"(1+IFERROR(VLOOKUP(Wycena!$C$45,Mapping!$EZ$3:$FC$6,4,1),0)+IFERROR(VLOOKUP(Wycena!$C$49,Mapping!$EZ$3:$FC$6,4,1),0))*HT12","v":290},null,null,null,null,null,null,null,{"$f":"$IC$3:INDEX($IC$3:$IC$9,(ROWS($IB$3:$IB$9)-COUNTBLANK($IB$3:$IB$9)))","v":"-"},null,null,null,null,"Ukryty",1000,null,null,null,null,null,null,null,null,null,null,null,null,null,0.09,null,1000]
["DB 18",20,20,20,20,34,34,36,36,"W łuku w ościeżnicy",null,null,null,null,{"$f":"$O$3:INDEX($O$3:$O$10,(ROWS($M$3:$M$10)-COUNTBLANK($M$3:$M$10)))","v":""},null,null,null,null,null,null,null,null,null,"Teak",0,"Teak",{"$f":"IF((VLOOKUP(Wycena!$C$7,Mapping!$Q$15:$R$20,2,0))=\"tak\",\"\",AA13)","v":"Teak"},{"$f":"IF(ROWS($AB$3:AB13)>(ROWS($AB$3:$AB$229)-COUNTBLANK($AB$3:$AB$229)),\"\",INDEX($AB$3:$AB$229,SMALL(IF($AB$3:$AB$229<>\"\",ROW($AB$3:$AB$229)-2),ROWS($AB$3:AB13))))","v":{"$error":"#N/A"}},null,null,null,null,null,null,null,null,null,null,null,null,null,null,null,null,null,null,null,null,82,0,0,{"$f":"IF(Wycena!$C$16=78,Mapping!AY13,AZ13)","v":0},null,null,190,0,0,{"$f":"IF(Wycena!$C$16=78,Mapping!BE13,BF13)","v":0},null,null,null,null,null,null,null,null,null,null,null,{"$error":"#N/A"},null,null,null,null,null,null,null,"x","x",null,{"$f":"IF(Wycena!$C$22=\"Imitacja skrzydła\",CA12,\"\")","v":""},{"$f":"IF(Wycena!$C$22=\"-\",\"\",CD13)","v":""},{"$f":"IF(ROWS($CE$3:CE13)>(ROWS($CE$3:$CE$13)-COUNTBLANK($CE$3:$CE$13)),\"\",INDEX($CE$3:$CE$13,SMALL(IF($CE$3:$CE$13<>\"\",ROW($CE$3:$CE$13)-2),ROWS($CE$3:CE13))))","v":""},null,null,null,null,null,null,null,null,null,null,null,null,null,null,null,null,null,null,"Przylgowe",26,15,{"$f":"IF(DA13>=VLOOKUP(Wycena!$C$14,Mapping!$CY$3:$CZ$5,2,0),DA13,\"\")","v":15},{"$f":"IF(ROWS($DB$3:DB13)>(ROWS($DB$3:$DB$28)-COUNTBLANK($DB$3:$DB$28)),\"\",INDEX($DB$3:$DB$28,SMALL(IF($DB$3:$DB$28<>\"\",ROW($DB$3:$DB$28)-2),ROWS($DB$3:DB13))))","v":16},null,null,null,"Przylgowe",26,26,null,15,{"$f":"IF(DK13>=VLOOKUP(Wycena!$C$14,Mapping!$DG$3:$DH$5,2,0),DK13,\"\")","v":15},{"$f":"IF(ROWS($DL$3:DL13)>(ROWS($DL$3:$DL$28)-COUNTBLANK($DL$3:$DL$28)),\"\",INDEX($DL$3:$DL$28,SMALL(IF($DL$3:$DL$28<>\"\",ROW($DL$3:$DL$28)-2),ROWS($DL$3:DL13))))","v":16},{"$f":"IF(DK13>=VLOOKUP(Wycena!$C$14,Mapping!$DG$3:$DI$5,3,0),DK13,\"\")","v":15},{"$f":"IF(ROWS($DN$3:DN13)>(ROWS($DN$3:$DN$28)-COUNTBLANK($DN$3:$DN$28)),\"\",INDEX($DN$3:$DN$28,SMALL(IF($DN$3:$DN$28<>\"\",ROW($DN$3:$DN$28)-2),ROWS($DN$3:DN13))))","v":16},null,"standardowa",18,15,{"$f":"IF(DS13>=VLOOKUP(Wycena!$C$25,Mapping!$DQ$3:$DR$4,2,0),DS13,\"\")","v":15},{"$f":"IF(ROWS($DT$3:DT13)>(ROWS($DT$3:$DT$28)-COUNTBLANK($DT$3:$DT$28)),\"\",INDEX($DT$3:$DT$28,SMALL(IF($DT$3:$DT$28<>\"\",ROW($DT$3:$DT$28)-2),ROWS($DT$3:DT13))))","v":20},null,10,null,null,null,null,null,null,null,null,null,null,null,null,null,null,null,null,null,null,null,null,null,null,null,null,null,null,null,null,null,null,null,null,null,"Dyskretne lustro weneckie w głębi",600,{"$f":"IF(OR(Wycena!$C$20=\"Imitacja skrzydła stała\",Wycena!$C$20=\"Imitacja skrzydła ruchoma\"),FE13,\"\")","v":""},{"$f":"IF(Wycena!$C$20=\"-\",\"\",FG13)","v":""},{"$f":"IF(ROWS($FH$3:FH13)>(ROWS($FH$3:$FH$14)-COUNTBLANK($FH$3:$FH$14)),\"\",INDEX($FH$3:$FH$14,SMALL(IF($FH$3:$FH$14<>\"\",ROW($FH$3:$FH$14)-2),ROWS($FH$3:FH13))))","v":""},{"$f":"IF(OR(Wycena!$C$21=\"Imitacja skrzydła stała\",Wycena!$C$21=\"Imitacja skrzydła ruchoma\"),FE13,\"\")","v":""},{"$f":"IF(Wycena!$C$21=\"-\",\"\",FJ13)","v":""},{"$f":"IF(ROWS($FK$3:FK13)>(ROWS($FK$3:$FK$14)-COUNTBLANK($FK$3:$FK$14)),\"\",INDEX($FK$3:$FK$14,SMALL(IF($FK$3:$FK$14<>\"\",ROW($FK$3:$FK$14)-2),ROWS($FK$3:FK13))))","v":""},null,null,10,{"$f":"IF(Wycena!$C$20=\"-\",\"\",FO13)","v":""},{"$f":"IF(ROWS($FP$3:FP13)>(ROWS($FP$3:$FP$23)-COUNTBLANK($FP$3:$FP$23)),\"\",INDEX($FP$3:$FP$23,SMALL(IF($FP$3:$FP$23<>\"\",ROW($FP$3:$FP$23)-2),ROWS($FP$3:FP13))))","v":""},{"$f":"IF(Wycena!$C$21=\"-\",\"\",FO13)","v":""},{"$f":"IF(ROWS($FR$3:FR13)>(ROWS($FR$3:$FR$23)-COUNTBLANK($FR$3:$FR$23)),\"\",INDEX($FR$3:$FR$23,SMALL(IF($FR$3:$FR$23<>\"\",ROW($FR$3:$FR$23)-2),ROWS($FR$3:FR13))))","v":""},{"$f":"IF(Wycena!$C$22=\"-\",\"\",FO13)","v":""},{"$f":"IF(ROWS($FT$3:FT13)>(ROWS($FT$3:$FT$23)-COUNTBLANK($FT$3:$FT$23)),\"\",INDEX($FT$3:$FT$23,SMALL(IF($FT$3:$FT$23<>\"\",ROW($FT$3:$FT$23)-2),ROWS($FT$3:FT13))))","v":""},null,null,null,null,{"$f":"$FZ$3:INDEX($FZ$3:$FZ$10,(ROWS($FY$3:$FY$10)-COUNTBLANK($FY$3:$FY$10)))","v":"Ryglowy 3-punktowy z gałką (standard)"},"Klamko - gałka Medos Warszawa",250,"Klamko - gałka Medos Warszawa","Klamko - gałka Medos Warszawa",null,null,null,null,null,{"$f":"IF((HLOOKUP(VLOOKUP(Wycena!$C$59,Mapping!$GI$35:$GJ$43,2,0),$GD$1:$GI$33,2+GK13))=0,\"\",(HLOOKUP(VLOOKUP(Wycena!$C$59,Mapping!$GI$35:$GJ$43,2,0),$GD$1:$GI$33,2+GK13)))","v":"Klamko - gałka Medos Warszawa"},11,{"$f":"IF(ROWS($GJ$3:GJ13)>(ROWS($GJ$3:$GJ$33)-COUNTBLANK($GJ$3:$GJ$33)),\"\",INDEX($GJ$3:$GJ$33,SMALL(IF($GJ$3:$GJ$33<>\"\",ROW($GJ$3:$GJ$33)-2),ROWS($GJ$3:GJ13))))","v":{"$error":"#N/A"}},"Klamka AXA Diva Flex","Inox",null,null,null,"-",null,null,null,null,null,null,null,null,null,null,null,null,null,"W dostawkach i naświetlu",1200,1200,"W dostawkach i naświetlu",{"$f":"IF(AND(Wycena!$C$20<>\"-\",Wycena!$C$21<>\"-\",Wycena!$C$22<>\"-\"),HI13,\"\")","v":""},{"$f":"IF(ROWS($HJ$3:HJ13)>(ROWS($HJ$3:$HJ$13)-COUNTBLANK($HJ$3:$HJ$13)),\"\",INDEX($HJ$3:$HJ$13,SMALL(IF($HJ$3:$HJ$13<>\"\",ROW($HJ$3:$HJ$13)-2),ROWS($HJ$3:HJ13))))","v":""},null,"Prawe do wewnątrz",0,null,null,null,null,20,220,{"$f":"(1+IFERROR(VLOOKUP(Wycena!$C$45,Mapping!$EZ$3:$FC$6,4,1),0)+IFERROR(VLOOKUP(Wycena!$C$49,Mapping!$EZ$3:$FC$6,4,1),0))*HT13","v":220},null,null,null,null,null,null,null,null,null,null,null,null,"Ukryty z funkcją stop",1150,null,null,null,null,null,null,null,null,null,null,null,null,null,0.1,null,1100]
["DB 19a",20,20,20,20,50,50,50,50,null,null,null,null,null,null,null,"Wykończenie po konstukcji",null,null,null,null,null,null,null,"Vintage oak",0,"Vintage oak",{"$f":"IF((VLOOKUP(Wycena!$C$7,Mapping!$Q$15:$R$20,2,0))=\"tak\",\"\",AA14)","v":"Vintage oak"},{"$f":"IF(ROWS($AB$3:AB14)>(ROWS($AB$3:$AB$229)-COUNTBLANK($AB$3:$AB$229)),\"\",INDEX($AB$3:$AB$229,SMALL(IF($AB$3:$AB$229<>\"\",ROW($AB$3:$AB$229)-2),ROWS($AB$3:AB14))))","v":{"$error":"#N/A"}},null,null,null,null,null,null,null,null,null,null,null,null,null,null,null,null,null,null,null,null,83,0,0,{"$f":"IF(Wycena!$C$16=78,Mapping!AY14,AZ14)","v":0},null,null,191,0,0,{"$f":"IF(Wycena!$C$16=78,Mapping!BE14,BF14)","v":0},null,null,null,null,null,null,null,null,null,null,null,{"$error":"#N/A"},null,null,null,null,null,null,null,null,null,null,"x","x","x",null,null,null,null,null,null,null,null,null,null,null,null,null,null,{"$f":"$CU$3:INDEX($CU$3:$CU$11,(ROWS($CT$3:$CT$11)-COUNTBLANK($CT$3:$CT$11)))","v":"-"},null,null,null,"Bezprzylgowe",26,16,{"$f":"IF(DA14>=VLOOKUP(Wycena!$C$14,Mapping!$CY$3:$CZ$5,2,0),DA14,\"\")","v":16},{"$f":"IF(ROWS($DB$3:DB14)>(ROWS($DB$3:$DB$28)-COUNTBLANK($DB$3:$DB$28)),\"\",INDEX($DB$3:$DB$28,SMALL(IF($DB$3:$DB$28<>\"\",ROW($DB$3:$DB$28)-2),ROWS($DB$3:DB14))))","v":17},null,null,null,"Bezprzylgowe",26,26,null,16,{"$f":"IF(DK14>=VLOOKUP(Wycena!$C$14,Mapping!$DG$3:$DH$5,2,0),DK14,\"\")","v":16},{"$f":"IF(ROWS($DL$3:DL14)>(ROWS($DL$3:$DL$28)-COUNTBLANK($DL$3:$DL$28)),\"\",INDEX($DL$3:$DL$28,SMALL(IF($DL$3:$DL$28<>\"\",ROW($DL$3:$DL$28)-2),ROWS($DL$3:DL14))))","v":17},{"$f":"IF(DK14>=VLOOKUP(Wycena!$C$14,Mapping!$DG$3:$DI$5,3,0),DK14,\"\")","v":16},{"$f":"IF(ROWS($DN$3:DN14)>(ROWS($DN$3:$DN$28)-COUNTBLANK($DN$3:$DN$28)),\"\",INDEX($DN$3:$DN$28,SMALL(IF($DN$3:$DN$28<>\"\",ROW($DN$3:$DN$28)-2),ROWS($DN$3:DN14))))","v":17},null,"krosnowa",18,16,{"$f":"IF(DS14>=VLOOKUP(Wycena!$C$25,Mapping!$DQ$3:$DR$4,2,0),DS14,\"\")","v":16},{"$f":"IF(ROWS($DT$3:DT14)>(ROWS($DT$3:$DT$28)-COUNTBLANK($DT$3:$DT$28)),\"\",INDEX($DT$3:$DT$28,SMALL(IF($DT$3:$DT$28<>\"\",ROW($DT$3:$DT$28)-2),ROWS($DT$3:DT14))))","v":21},null,11,null,null,null,null,null,null,null,null,null,null,null,null,null,null,null,null,null,null,null,null,null,null,null,null,null,null,null,null,null,null,null,null,null,"Witraż",1000,{"$f":"IF(OR(Wycena!$C$20=\"Imitacja skrzydła stała\",Wycena!$C$20=\"Imitacja skrzydła ruchoma\",Wycena!$C$20=\"W ościeżnicy tradycyjna\"),FE14,\"\")","v":""},{"$f":"IF(Wycena!$C$20=\"-\",\"\",FG14)","v":""},{"$f":"IF(ROWS($FH$3:FH14)>(ROWS($FH$3:$FH$14)-COUNTBLANK($FH$3:$FH$14)),\"\",INDEX($FH$3:$FH$14,SMALL(IF($FH$3:$FH$14<>\"\",ROW($FH$3:$FH$14)-2),ROWS($FH$3:FH14))))","v":""},{"$f":"IF(OR(Wycena!$C$21=\"Imitacja skrzydła stała\",Wycena!$C$21=\"Imitacja skrzydła ruchoma\",Wycena!$C$21=\"W ościeżnicy tradycyjna\"),FE14,\"\")","v":""},{"$f":"IF(Wycena!$C$21=\"-\",\"\",FJ14)","v":""},{"$f":"IF(ROWS($FK$3:FK14)>(ROWS($FK$3:$FK$14)-COUNTBLANK($FK$3:$FK$14)),\"\",INDEX($FK$3:$FK$14,SMALL(IF($FK$3:$FK$14<>\"\",ROW($FK$3:$FK$14)-2),ROWS($FK$3:FK14))))","v":""},null,null,11,{"$f":"IF(Wycena!$C$20=\"-\",\"\",FO14)","v":""},{"$f":"IF(ROWS($FP$3:FP14)>(ROWS($FP$3:$FP$23)-COUNTBLANK($FP$3:$FP$23)),\"\",INDEX($FP$3:$FP$23,SMALL(IF($FP$3:$FP$23<>\"\",ROW($FP$3:$FP$23)-2),ROWS($FP$3:FP14))))","v":""},{"$f":"IF(Wycena!$C$21=\"-\",\"\",FO14)","v":""},{"$f":"IF(ROWS($FR$3:FR14)>(ROWS($FR$3:$FR$23)-COUNTBLANK($FR$3:$FR$23)),\"\",INDEX($FR$3:$FR$23,SMALL(IF($FR$3:$FR$23<>\"\",ROW($FR$3:$FR$23)-2),ROWS($FR$3:FR14))))","v":""},{"$f":"IF(Wycena!$C$22=\"-\",\"\",FO14)","v":""},{"$f":"IF(ROWS($FT$3:FT14)>(ROWS($FT$3:$FT$23)-COUNTBLANK($FT$3:$FT$23)),\"\",INDEX($FT$3:$FT$23,SMALL(IF($FT$3:$FT$23<>\"\",ROW($FT$3:$FT$23)-2),ROWS($FT$3:FT14))))","v":""},null,"zestaw specjalny","zamek","Cena",null,"Klamko - gałka Medos Dublin",250,"Klamko - gałka Medos Dublin","Klamko - gałka Medos Dublin",null,null,null,null,null,{"$f":"IF((HLOOKUP(VLOOKUP(Wycena!$C$59,Mapping!$GI$35:$GJ$43,2,0),$GD$1:$GI$33,2+GK14))=0,\"\",(HLOOKUP(VLOOKUP(Wycena!$C$59,Mapping!$GI$35:$GJ$43,2,0),$GD$1:$GI$33,2+GK14)))","v":"Klamko - gałka Medos Dublin"},12,{"$f":"IF(ROWS($GJ$3:GJ14)>(ROWS($GJ$3:$GJ$33)-COUNTBLANK($GJ$3:$GJ$33)),\"\",INDEX($GJ$3:$GJ$33,SMALL(IF($GJ$3:$GJ$33<>\"\",ROW($GJ$3:$GJ$33)-2),ROWS($GJ$3:GJ14))))","v":{"$error":"#N/A"}},"Klamka AXA Diva Flex","Tytan",null,null,null,"-",null,null,null,null,"Po zestawie",null,null,null,null,null,null,null,null,"x","x","x","x","x","x",null,null,null,null,null,null,null,21,{"$f":"110+70+120","v":300},{"$f":"(1+IFERROR(VLOOKUP(Wycena!$C$45,Mapping!$EZ$3:$FC$6,4,1),0)+IFERROR(VLOOKUP(Wycena!$C$49,Mapping!$EZ$3:$FC$6,4,1),0))*HT14","v":300},null,null,null,null,null,null,null,null,null,null,null,null,null,null,null,null,null,null,null,null,null,null,null,null,null,null,null,0.11,null,1200]
["DB 20",20,20,20,20,34,34,{"$f":"F15+2","v":36},{"$f":"G15+2","v":36},null,null,null,null,null,null,null,"Dab prosty podluzny","nie",null,null,null,null,null,null,"Winchester",0,"Winchester",{"$f":"AA15","v":"Winchester"},{"$f":"IF(ROWS($AB$3:AB15)>(ROWS($AB$3:$AB$229)-COUNTBLANK($AB$3:$AB$229)),\"\",INDEX($AB$3:$AB$229,SMALL(IF($AB$3:$AB$229<>\"\",ROW($AB$3:$AB$229)-2),ROWS($AB$3:AB15))))","v":{"$error":"#N/A"}},null,null,null,null,null,null,null,null,null,null,null,null,null,null,null,null,null,null,null,null,84,0,0,{"$f":"IF(Wycena!$C$16=78,Mapping!AY15,AZ15)","v":0},null,null,192,0,0,{"$f":"IF(Wycena!$C$16=78,Mapping!BE15,BF15)","v":0},null,null,null,null,null,null,null,null,null,null,null,{"$error":"#N/A"},null,null,null,null,null,null,null,null,null,null,null,null,null,null,null,null,null,null,null,null,null,{"$f":"VLOOKUP(Wycena!C26,$CO$16:$CS$25,IF(AND(Wycena!C20=\"-\",Wycena!C21=\"-\"),2,IF(AND(Wycena!C20<>\"-\",Wycena!C21=\"-\"),3,IF(AND(Wycena!C20=\"-\",Wycena!C21<>\"-\"),4,5))),0)","v":0},null,null,null,null,null,null,null,null,null,"Bezprzylgowe Glass",70,17,{"$f":"IF(DA15>=VLOOKUP(Wycena!$C$14,Mapping!$CY$3:$CZ$5,2,0),DA15,\"\")","v":17},{"$f":"IF(ROWS($DB$3:DB15)>(ROWS($DB$3:$DB$28)-COUNTBLANK($DB$3:$DB$28)),\"\",INDEX($DB$3:$DB$28,SMALL(IF($DB$3:$DB$28<>\"\",ROW($DB$3:$DB$28)-2),ROWS($DB$3:DB15))))","v":18},null,null,null,"Bezprzylgowe Glass",70,70,null,17,{"$f":"IF(DK15>=VLOOKUP(Wycena!$C$14,Mapping!$DG$3:$DH$5,2,0),DK15,\"\")","v":17},{"$f":"IF(ROWS($DL$3:DL15)>(ROWS($DL$3:$DL$28)-COUNTBLANK($DL$3:$DL$28)),\"\",INDEX($DL$3:$DL$28,SMALL(IF($DL$3:$DL$28<>\"\",ROW($DL$3:$DL$28)-2),ROWS($DL$3:DL15))))","v":18},{"$f":"IF(DK15>=VLOOKUP(Wycena!$C$14,Mapping!$DG$3:$DI$5,3,0),DK15,\"\")","v":17},{"$f":"IF(ROWS($DN$3:DN15)>(ROWS($DN$3:$DN$28)-COUNTBLANK($DN$3:$DN$28)),\"\",INDEX($DN$3:$DN$28,SMALL(IF($DN$3:$DN$28<>\"\",ROW($DN$3:$DN$28)-2),ROWS($DN$3:DN15))))","v":18},null,null,null,17,{"$f":"IF(DS15>=VLOOKUP(Wycena!$C$25,Mapping!$DQ$3:$DR$4,2,0),DS15,\"\")","v":17},{"$f":"IF(ROWS($DT$3:DT15)>(ROWS($DT$3:$DT$28)-COUNTBLANK($DT$3:$DT$28)),\"\",INDEX($DT$3:$DT$28,SMALL(IF($DT$3:$DT$28<>\"\",ROW($DT$3:$DT$28)-2),ROWS($DT$3:DT15))))","v":22},null,12,null,null,null,null,null,null,null,null,null,null,null,null,null,null,null,null,null,null,null,null,null,null,null,null,null,null,null,null,null,null,null,null,null,"x","x","x","x","x","x","x","x",null,null,12,{"$f":"IF(Wycena!$C$20=\"-\",\"\",FO15)","v":""},{"$f":"IF(ROWS($FP$3:FP15)>(ROWS($FP$3:$FP$23)-COUNTBLANK($FP$3:$FP$23)),\"\",INDEX($FP$3:$FP$23,SMALL(IF($FP$3:$FP$23<>\"\",ROW($FP$3:$FP$23)-2),ROWS($FP$3:FP15))))","v":""},{"$f":"IF(Wycena!$C$21=\"-\",\"\",FO15)","v":""},{"$f":"IF(ROWS($FR$3:FR15)>(ROWS($FR$3:$FR$23)-COUNTBLANK($FR$3:$FR$23)),\"\",INDEX($FR$3:$FR$23,SMALL(IF($FR$3:$FR$23<>\"\",ROW($FR$3:$FR$23)-2),ROWS($FR$3:FR15))))","v":""},{"$f":"IF(Wycena!$C$22=\"-\",\"\",FO15)","v":""},{"$f":"IF(ROWS($FT$3:FT15)>(ROWS($FT$3:$FT$23)-COUNTBLANK($FT$3:$FT$23)),\"\",INDEX($FT$3:$FT$23,SMALL(IF($FT$3:$FT$23<>\"\",ROW($FT$3:$FT$23)-2),ROWS($FT$3:FT15))))","v":""},null,"Brak (standard)","Ryglowy 3-punktowy z gałką (standard)","Ryglowy 3-punktowy z gałką (standard)",0,"Klamko - gałka Hoppe Bezpieczna",550,"Klamko - gałka Hoppe Bezpieczna","Klamko - gałka Hoppe Bezpieczna",null,null,null,null,null,{"$f":"IF((HLOOKUP(VLOOKUP(Wycena!$C$59,Mapping!$GI$35:$GJ$43,2,0),$GD$1:$GI$33,2+GK15))=0,\"\",(HLOOKUP(VLOOKUP(Wycena!$C$59,Mapping!$GI$35:$GJ$43,2,0),$GD$1:$GI$33,2+GK15)))","v":"Klamko - gałka Hoppe Bezpieczna"},13,{"$f":"IF(ROWS($GJ$3:GJ15)>(ROWS($GJ$3:$GJ$33)-COUNTBLANK($GJ$3:$GJ$33)),\"\",INDEX($GJ$3:$GJ$33,SMALL(IF($GJ$3:$GJ$33<>\"\",ROW($GJ$3:$GJ$33)-2),ROWS($GJ$3:GJ15))))","v":{"$error":"#N/A"}},"Klamka AXA Diva Flex","Stare złoto",null,null,null,"-",null,null,null,null,"Brak (standard)","-",null,null,null,null,null,null,null,null,null,null,null,null,null,null,null,null,null,null,null,null,23,280,{"$f":"(1+IFERROR(VLOOKUP(Wycena!$C$45,Mapping!$EZ$3:$FC$6,4,1),0)+IFERROR(VLOOKUP(Wycena!$C$49,Mapping!$EZ$3:$FC$6,4,1),0))*HT15","v":280},null,null,null,null,null,null,null,null,null,null,null,null,null,null,null,null,null,null,null,null,null,null,null,null,null,null,null,0.12,null,1300]
["DB 21",20,20,20,20,44,44,44,44,null,null,null,null,null,null,null,"Dąb prosty poprzeczny","nie",null,null,null,null,null,null,"Złoty dąb",0,"Złoty dąb",{"$f":"AA16","v":"Złoty dąb"},{"$f":"IF(ROWS($AB$3:AB16)>(ROWS($AB$3:$AB$229)-COUNTBLANK($AB$3:$AB$229)),\"\",INDEX($AB$3:$AB$229,SMALL(IF($AB$3:$AB$229<>\"\",ROW($AB$3:$AB$229)-2),ROWS($AB$3:AB16))))","v":{"$error":"#N/A"}},null,null,null,null,null,null,null,null,null,null,null,null,null,null,null,null,null,null,null,null,85,0,0,{"$f":"IF(Wycena!$C$16=78,Mapping!AY16,AZ16)","v":0},null,null,193,0,0,{"$f":"IF(Wycena!$C$16=78,Mapping!BE16,BF16)","v":0},null,null,null,null,null,null,null,null,null,null,null,null,null,null,null,null,null,null,null,null,null,null,null,null,{"$f":"$CF$3:INDEX($CF$3:$CF$13,(ROWS($CE$3:$CE$13)-COUNTBLANK($CE$3:$CE$13)))","v":"-"},null,null,null,null,null,null,null,null,"Dla ościeżnicy od zawias","SOLO","DOSTAWKA OD ZAWIAS","DOSTAWKA OD ZAMKA","2 DOSTAWKI",null,null,null,null,null,null,null,18,{"$f":"IF(DA16>=VLOOKUP(Wycena!$C$14,Mapping!$CY$3:$CZ$5,2,0),DA16,\"\")","v":18},{"$f":"IF(ROWS($DB$3:DB16)>(ROWS($DB$3:$DB$28)-COUNTBLANK($DB$3:$DB$28)),\"\",INDEX($DB$3:$DB$28,SMALL(IF($DB$3:$DB$28<>\"\",ROW($DB$3:$DB$28)-2),ROWS($DB$3:DB16))))","v":19},null,null,null,null,null,null,null,18,{"$f":"IF(DK16>=VLOOKUP(Wycena!$C$14,Mapping!$DG$3:$DH$5,2,0),DK16,\"\")","v":18},{"$f":"IF(ROWS($DL$3:DL16)>(ROWS($DL$3:$DL$28)-COUNTBLANK($DL$3:$DL$28)),\"\",INDEX($DL$3:$DL$28,SMALL(IF($DL$3:$DL$28<>\"\",ROW($DL$3:$DL$28)-2),ROWS($DL$3:DL16))))","v":19},{"$f":"IF(DK16>=VLOOKUP(Wycena!$C$14,Mapping!$DG$3:$DI$5,3,0),DK16,\"\")","v":18},{"$f":"IF(ROWS($DN$3:DN16)>(ROWS($DN$3:$DN$28)-COUNTBLANK($DN$3:$DN$28)),\"\",INDEX($DN$3:$DN$28,SMALL(IF($DN$3:$DN$28<>\"\",ROW($DN$3:$DN$28)-2),ROWS($DN$3:DN16))))","v":19},null,null,null,18,{"$f":"IF(DS16>=VLOOKUP(Wycena!$C$25,Mapping!$DQ$3:$DR$4,2,0),DS16,\"\")","v":18},{"$f":"IF(ROWS($DT$3:DT16)>(ROWS($DT$3:$DT$28)-COUNTBLANK($DT$3:$DT$28)),\"\",INDEX($DT$3:$DT$28,SMALL(IF($DT$3:$DT$28<>\"\",ROW($DT$3:$DT$28)-2),ROWS($DT$3:DT16))))","v":23},null,13,null,null,null,null,null,null,null,null,null,null,null,null,null,null,null,null,null,null,null,null,null,null,null,null,null,null,null,null,null,null,null,null,null,null,null,null,null,null,null,null,null,null,null,13,{"$f":"IF(Wycena!$C$20=\"-\",\"\",FO16)","v":""},{"$f":"IF(ROWS($FP$3:FP16)>(ROWS($FP$3:$FP$23)-COUNTBLANK($FP$3:$FP$23)),\"\",INDEX($FP$3:$FP$23,SMALL(IF($FP$3:$FP$23<>\"\",ROW($FP$3:$FP$23)-2),ROWS($FP$3:FP16))))","v":""},{"$f":"IF(Wycena!$C$21=\"-\",\"\",FO16)","v":""},{"$f":"IF(ROWS($FR$3:FR16)>(ROWS($FR$3:$FR$23)-COUNTBLANK($FR$3:$FR$23)),\"\",INDEX($FR$3:$FR$23,SMALL(IF($FR$3:$FR$23<>\"\",ROW($FR$3:$FR$23)-2),ROWS($FR$3:FR16))))","v":""},{"$f":"IF(Wycena!$C$22=\"-\",\"\",FO16)","v":""},{"$f":"IF(ROWS($FT$3:FT16)>(ROWS($FT$3:$FT$23)-COUNTBLANK($FT$3:$FT$23)),\"\",INDEX($FT$3:$FT$23,SMALL(IF($FT$3:$FT$23<>\"\",ROW($FT$3:$FT$23)-2),ROWS($FT$3:FT16))))","v":""},null,"Brak (standard)","Ryglowy 3-punktowy bez gałki (standard)","Ryglowy 3-punktowy bez gałki (standard)",0,"Klamko - gałka AXA Diva Flex",500,"Klamko - gałka AXA Diva Flex","Klamko - gałka AXA Diva Flex",null,null,null,null,null,{"$f":"IF((HLOOKUP(VLOOKUP(Wycena!$C$59,Mapping!$GI$35:$GJ$43,2,0),$GD$1:$GI$33,2+GK16))=0,\"\",(HLOOKUP(VLOOKUP(Wycena!$C$59,Mapping!$GI$35:$GJ$43,2,0),$GD$1:$GI$33,2+GK16)))","v":"Klamko - gałka AXA Diva Flex"},14,{"$f":"IF(ROWS($GJ$3:GJ16)>(ROWS($GJ$3:$GJ$33)-COUNTBLANK($GJ$3:$GJ$33)),\"\",INDEX($GJ$3:$GJ$33,SMALL(IF($GJ$3:$GJ$33<>\"\",ROW($GJ$3:$GJ$33)-2),ROWS($GJ$3:GJ16))))","v":{"$error":"#N/A"}},"Klamka AXA Haga Plus","Inox",null,null,null,"-",null,null,null,null,"Brak (standard)","Manualna",null,null,null,null,null,null,null,null,null,null,null,null,{"$f":"$HK$3:INDEX($HK$3:$HK$13,(ROWS($HJ$3:$HJ$13)-COUNTBLANK($HJ$3:$HJ$13)))","v":"-"},null,null,null,null,null,null,null,24,360,{"$f":"(1+IFERROR(VLOOKUP(Wycena!$C$45,Mapping!$EZ$3:$FC$6,4,1),0)+IFERROR(VLOOKUP(Wycena!$C$49,Mapping!$EZ$3:$FC$6,4,1),0))*HT16","v":360},null,null,null,null,null,null,null,null,null,null,null,null,null,null,null,null,null,null,null,null,null,null,null,null,null,null,null,0.13,null,1400]
["DB 28",20,20,20,20,63,63,63,63,null,null,null,null,null,null,null,"Dab flader podłużny","tak",null,null,null,null,null,null,"RAL 9016 biały",0,"RAL 9016 biały",{"$f":"IF((VLOOKUP(Wycena!$C$7,Mapping!$Q$15:$R$20,2,0))=\"tak\",\"\",AA17)","v":"RAL 9016 biały"},{"$f":"IF(ROWS($AB$3:AB17)>(ROWS($AB$3:$AB$229)-COUNTBLANK($AB$3:$AB$229)),\"\",INDEX($AB$3:$AB$229,SMALL(IF($AB$3:$AB$229<>\"\",ROW($AB$3:$AB$229)-2),ROWS($AB$3:AB17))))","v":{"$error":"#N/A"}},null,null,null,null,null,null,null,null,null,null,null,null,null,null,null,null,null,null,null,null,86,0,0,{"$f":"IF(Wycena!$C$16=78,Mapping!AY17,AZ17)","v":0},null,null,194,0,0,{"$f":"IF(Wycena!$C$16=78,Mapping!BE17,BF17)","v":0},null,null,null,null,null,null,null,null,null,null,null,null,null,null,null,null,null,null,null,null,null,null,null,null,null,null,null,null,null,null,null,null,null,"-",0,0,0,0,null,null,null,null,null,null,null,19,{"$f":"IF(DA17>=VLOOKUP(Wycena!$C$14,Mapping!$CY$3:$CZ$5,2,0),DA17,\"\")","v":19},{"$f":"IF(ROWS($DB$3:DB17)>(ROWS($DB$3:$DB$28)-COUNTBLANK($DB$3:$DB$28)),\"\",INDEX($DB$3:$DB$28,SMALL(IF($DB$3:$DB$28<>\"\",ROW($DB$3:$DB$28)-2),ROWS($DB$3:DB17))))","v":20},null,null,null,null,null,null,null,19,{"$f":"IF(DK17>=VLOOKUP(Wycena!$C$14,Mapping!$DG$3:$DH$5,2,0),DK17,\"\")","v":19},{"$f":"IF(ROWS($DL$3:DL17)>(ROWS($DL$3:$DL$28)-COUNTBLANK($DL$3:$DL$28)),\"\",INDEX($DL$3:$DL$28,SMALL(IF($DL$3:$DL$28<>\"\",ROW($DL$3:$DL$28)-2),ROWS($DL$3:DL17))))","v":20},{"$f":"IF(DK17>=VLOOKUP(Wycena!$C$14,Mapping!$DG$3:$DI$5,3,0),DK17,\"\")","v":19},{"$f":"IF(ROWS($DN$3:DN17)>(ROWS($DN$3:$DN$28)-COUNTBLANK($DN$3:$DN$28)),\"\",INDEX($DN$3:$DN$28,SMALL(IF($DN$3:$DN$28<>\"\",ROW($DN$3:$DN$28)-2),ROWS($DN$3:DN17))))","v":20},null,null,null,19,{"$f":"IF(DS17>=VLOOKUP(Wycena!$C$25,Mapping!$DQ$3:$DR$4,2,0),DS17,\"\")","v":19},{"$f":"IF(ROWS($DT$3:DT17)>(ROWS($DT$3:$DT$28)-COUNTBLANK($DT$3:$DT$28)),\"\",INDEX($DT$3:$DT$28,SMALL(IF($DT$3:$DT$28<>\"\",ROW($DT$3:$DT$28)-2),ROWS($DT$3:DT17))))","v":24},null,14,null,{"$f":"3*25","v":75},null,null,null,null,null,null,null,null,null,null,null,null,null,null,null,null,null,null,null,null,null,null,null,null,null,null,null,null,null,null,null,null,null,null,null,{"$f":"$FI$3:INDEX($FI$3:$FI$14,(ROWS($FH$3:$FH$14)-COUNTBLANK($FH$3:$FH$14)))","v":"-"},null,null,{"$f":"$FL$3:INDEX($FL$3:$FL$14,(ROWS($FK$3:$FK$14)-COUNTBLANK($FK$3:$FK$14)))","v":"-"},null,null,14,{"$f":"IF(Wycena!$C$20=\"-\",\"\",FO17)","v":""},{"$f":"IF(ROWS($FP$3:FP17)>(ROWS($FP$3:$FP$23)-COUNTBLANK($FP$3:$FP$23)),\"\",INDEX($FP$3:$FP$23,SMALL(IF($FP$3:$FP$23<>\"\",ROW($FP$3:$FP$23)-2),ROWS($FP$3:FP17))))","v":""},{"$f":"IF(Wycena!$C$21=\"-\",\"\",FO17)","v":""},{"$f":"IF(ROWS($FR$3:FR17)>(ROWS($FR$3:$FR$23)-COUNTBLANK($FR$3:$FR$23)),\"\",INDEX($FR$3:$FR$23,SMALL(IF($FR$3:$FR$23<>\"\",ROW($FR$3:$FR$23)-2),ROWS($FR$3:FR17))))","v":""},{"$f":"IF(Wycena!$C$22=\"-\",\"\",FO17)","v":""},{"$f":"IF(ROWS($FT$3:FT17)>(ROWS($FT$3:$FT$23)-COUNTBLANK($FT$3:$FT$23)),\"\",INDEX($FT$3:$FT$23,SMALL(IF($FT$3:$FT$23<>\"\",ROW($FT$3:$FT$23)-2),ROWS($FT$3:FT17))))","v":""},null,"Brak (standard)","Ryglowy 4-punktowy","Ryglowy 4-punktowy",300,"Klamko - gałka AXA Haga Plus",250,"Klamko - gałka AXA Haga Plus","Klamko - gałka AXA Haga Plus",null,null,null,null,null,{"$f":"IF((HLOOKUP(VLOOKUP(Wycena!$C$59,Mapping!$GI$35:$GJ$43,2,0),$GD$1:$GI$33,2+GK17))=0,\"\",(HLOOKUP(VLOOKUP(Wycena!$C$59,Mapping!$GI$35:$GJ$43,2,0),$GD$1:$GI$33,2+GK17)))","v":"Klamko - gałka AXA Haga Plus"},15,{"$f":"IF(ROWS($GJ$3:GJ17)>(ROWS($GJ$3:$GJ$33)-COUNTBLANK($GJ$3:$GJ$33)),\"\",INDEX($GJ$3:$GJ$33,SMALL(IF($GJ$3:$GJ$33<>\"\",ROW($GJ$3:$GJ$33)-2),ROWS($GJ$3:GJ17))))","v":{"$error":"#N/A"}},"Klamka AXA Haga Plus","Tytan",null,null,null,"-",null,null,null,null,"Brak (standard)","Elektrozaczep",null,null,null,null,null,null,null,null,null,null,null,null,null,null,null,null,null,null,null,null,25,290,{"$f":"(1+IFERROR(VLOOKUP(Wycena!$C$45,Mapping!$EZ$3:$FC$6,4,1),0)+IFERROR(VLOOKUP(Wycena!$C$49,Mapping!$EZ$3:$FC$6,4,1),0))*HT17","v":290},null,null,null,null,null,null,null,null,null,null,null,null,null,null,null,null,null,null,null,null,null,null,null,null,null,null,null,0.14000000000000001,null,1500]
["DB 31",20,20,20,20,34,34,{"$f":"F18+2","v":36},36,null,null,null,null,null,null,null,"Dąb flader poprzeczny","tak",null,null,null,null,null,null,"RAL 7016 antracyt",0,"RAL 7016 antracyt",{"$f":"IF((VLOOKUP(Wycena!$C$7,Mapping!$Q$15:$R$20,2,0))=\"tak\",\"\",AA18)","v":"RAL 7016 antracyt"},{"$f":"IF(ROWS($AB$3:AB18)>(ROWS($AB$3:$AB$229)-COUNTBLANK($AB$3:$AB$229)),\"\",INDEX($AB$3:$AB$229,SMALL(IF($AB$3:$AB$229<>\"\",ROW($AB$3:$AB$229)-2),ROWS($AB$3:AB18))))","v":{"$error":"#N/A"}},null,null,null,null,null,null,null,null,null,null,null,null,null,null,null,null,null,null,null,null,87,0,0,{"$f":"IF(Wycena!$C$16=78,Mapping!AY18,AZ18)","v":0},null,null,195,0,0,{"$f":"IF(Wycena!$C$16=78,Mapping!BE18,BF18)","v":0},null,null,null,null,null,null,null,null,null,null,null,null,null,null,null,null,null,null,null,null,null,null,null,null,null,null,null,null,null,null,null,null,null,"Przy skrzydle od zewnątrz",{"$f":"IF(Wycena!$C$14=\"Przylgowe\",8,IF(Wycena!$C$14=\"Bezprzylgowe\",6,0))","v":8},0,{"$f":"IF(Wycena!$C$14=\"Przylgowe\",8,IF(Wycena!$C$14=\"Bezprzylgowe\",6,0))","v":8},0,null,null,null,null,null,null,null,20,{"$f":"IF(DA18>=VLOOKUP(Wycena!$C$14,Mapping!$CY$3:$CZ$5,2,0),DA18,\"\")","v":20},{"$f":"IF(ROWS($DB$3:DB18)>(ROWS($DB$3:$DB$28)-COUNTBLANK($DB$3:$DB$28)),\"\",INDEX($DB$3:$DB$28,SMALL(IF($DB$3:$DB$28<>\"\",ROW($DB$3:$DB$28)-2),ROWS($DB$3:DB18))))","v":21},null,null,null,null,null,null,null,20,{"$f":"IF(DK18>=VLOOKUP(Wycena!$C$14,Mapping!$DG$3:$DH$5,2,0),DK18,\"\")","v":20},{"$f":"IF(ROWS($DL$3:DL18)>(ROWS($DL$3:$DL$28)-COUNTBLANK($DL$3:$DL$28)),\"\",INDEX($DL$3:$DL$28,SMALL(IF($DL$3:$DL$28<>\"\",ROW($DL$3:$DL$28)-2),ROWS($DL$3:DL18))))","v":21},{"$f":"IF(DK18>=VLOOKUP(Wycena!$C$14,Mapping!$DG$3:$DI$5,3,0),DK18,\"\")","v":20},{"$f":"IF(ROWS($DN$3:DN18)>(ROWS($DN$3:$DN$28)-COUNTBLANK($DN$3:$DN$28)),\"\",INDEX($DN$3:$DN$28,SMALL(IF($DN$3:$DN$28<>\"\",ROW($DN$3:$DN$28)-2),ROWS($DN$3:DN18))))","v":21},null,null,null,20,{"$f":"IF(DS18>=VLOOKUP(Wycena!$C$25,Mapping!$DQ$3:$DR$4,2,0),DS18,\"\")","v":20},{"$f":"IF(ROWS($DT$3:DT18)>(ROWS($DT$3:$DT$28)-COUNTBLANK($DT$3:$DT$28)),\"\",INDEX($DT$3:$DT$28,SMALL(IF($DT$3:$DT$28<>\"\",ROW($DT$3:$DT$28)-2),ROWS($DT$3:DT18))))","v":25},null,15,null,null,null,null,null,null,null,null,null,null,null,null,null,null,null,null,null,null,null,null,null,null,null,null,null,null,null,null,null,null,null,null,null,null,null,null,null,null,null,null,null,null,null,15,{"$f":"IF(Wycena!$C$20=\"-\",\"\",FO18)","v":""},{"$f":"IF(ROWS($FP$3:FP18)>(ROWS($FP$3:$FP$23)-COUNTBLANK($FP$3:$FP$23)),\"\",INDEX($FP$3:$FP$23,SMALL(IF($FP$3:$FP$23<>\"\",ROW($FP$3:$FP$23)-2),ROWS($FP$3:FP18))))","v":""},{"$f":"IF(Wycena!$C$21=\"-\",\"\",FO18)","v":""},{"$f":"IF(ROWS($FR$3:FR18)>(ROWS($FR$3:$FR$23)-COUNTBLANK($FR$3:$FR$23)),\"\",INDEX($FR$3:$FR$23,SMALL(IF($FR$3:$FR$23<>\"\",ROW($FR$3:$FR$23)-2),ROWS($FR$3:FR18))))","v":""},{"$f":"IF(Wycena!$C$22=\"-\",\"\",FO18)","v":""},{"$f":"IF(ROWS($FT$3:FT18)>(ROWS($FT$3:$FT$23)-COUNTBLANK($FT$3:$FT$23)),\"\",INDEX($FT$3:$FT$23,SMALL(IF($FT$3:$FT$23<>\"\",ROW($FT$3:$FT$23)-2),ROWS($FT$3:FT18))))","v":""},null,"Brak (standard)","Automat 3-punktowy z gałką","Automat 3-punktowy z gałką",{"$f":"IF(OR(Wycena!$C$59=Mapping!$FW$5,Wycena!C59=Mapping!FW7,Wycena!C59=Mapping!FW8,Wycena!C59=Mapping!FW9,Wycena!C59=Mapping!FW10),0,400)","v":400},"Klamko - gałka AXA Prestige Flex",500,"Klamko - gałka AXA Prestige Flex","Klamko - gałka AXA Prestige Flex",null,null,null,null,null,{"$f":"IF((HLOOKUP(VLOOKUP(Wycena!$C$59,Mapping!$GI$35:$GJ$43,2,0),$GD$1:$GI$33,2+GK18))=0,\"\",(HLOOKUP(VLOOKUP(Wycena!$C$59,Mapping!$GI$35:$GJ$43,2,0),$GD$1:$GI$33,2+GK18)))","v":"Klamko - gałka AXA Prestige Flex"},16,{"$f":"IF(ROWS($GJ$3:GJ18)>(ROWS($GJ$3:$GJ$33)-COUNTBLANK($GJ$3:$GJ$33)),\"\",INDEX($GJ$3:$GJ$33,SMALL(IF($GJ$3:$GJ$33<>\"\",ROW($GJ$3:$GJ$33)-2),ROWS($GJ$3:GJ18))))","v":{"$error":"#N/A"}},"Klamka AXA Haga Plus","Stare złoto",null,null,null,"-",null,null,null,null,"Zestaw elektronik z zamkiem ryglowym","Elektrozaczep",null,null,null,null,null,null,null,null,null,null,null,null,null,null,null,null,null,null,null,null,30,330,{"$f":"(1+IFERROR(VLOOKUP(Wycena!$C$45,Mapping!$EZ$3:$FC$6,4,1),0)+IFERROR(VLOOKUP(Wycena!$C$49,Mapping!$EZ$3:$FC$6,4,1),0))*HT18","v":330},null,null,null,null,null,null,null,null,null,null,null,null,null,null,null,null,null,null,null,null,null,null,null,null,null,null,null,0.15,null,1600]
["DB 31a",20,20,20,20,34,34,36,36,null,null,null,null,null,null,null,"Dąb sękaty podłużny","tak",null,null,null,null,null,null,"RAL 7040",0,"RAL 7040",{"$f":"IF((VLOOKUP(Wycena!$C$7,Mapping!$Q$15:$R$20,2,0))=\"tak\",\"\",AA19)","v":"RAL 7040"},{"$f":"IF(ROWS($AB$3:AB19)>(ROWS($AB$3:$AB$229)-COUNTBLANK($AB$3:$AB$229)),\"\",INDEX($AB$3:$AB$229,SMALL(IF($AB$3:$AB$229<>\"\",ROW($AB$3:$AB$229)-2),ROWS($AB$3:AB19))))","v":{"$error":"#N/A"}},null,null,null,null,null,null,null,null,null,null,null,null,null,null,null,null,null,null,null,null,88,0,0,{"$f":"IF(Wycena!$C$16=78,Mapping!AY19,AZ19)","v":0},null,null,196,0,0,{"$f":"IF(Wycena!$C$16=78,Mapping!BE19,BF19)","v":0},null,null,null,null,null,null,null,null,null,null,null,null,null,null,null,null,null,null,null,null,null,null,null,null,null,null,null,null,null,null,null,null,null,"Przy skrzydle z dwóch stron",{"$f":"IF(Wycena!$C$14=\"Przylgowe\",8,IF(Wycena!$C$14=\"Bezprzylgowe\",6,0))","v":8},0,{"$f":"IF(Wycena!$C$14=\"Przylgowe\",8,IF(Wycena!$C$14=\"Bezprzylgowe\",6,0))","v":8},0,null,null,null,null,null,null,null,21,{"$f":"IF(DA19>=VLOOKUP(Wycena!$C$14,Mapping!$CY$3:$CZ$5,2,0),DA19,\"\")","v":21},{"$f":"IF(ROWS($DB$3:DB19)>(ROWS($DB$3:$DB$28)-COUNTBLANK($DB$3:$DB$28)),\"\",INDEX($DB$3:$DB$28,SMALL(IF($DB$3:$DB$28<>\"\",ROW($DB$3:$DB$28)-2),ROWS($DB$3:DB19))))","v":22},null,null,null,"Ościeżnica od zawias pogrubienia w standardzie",null,null,null,21,{"$f":"IF(DK19>=VLOOKUP(Wycena!$C$14,Mapping!$DG$3:$DH$5,2,0),DK19,\"\")","v":21},{"$f":"IF(ROWS($DL$3:DL19)>(ROWS($DL$3:$DL$28)-COUNTBLANK($DL$3:$DL$28)),\"\",INDEX($DL$3:$DL$28,SMALL(IF($DL$3:$DL$28<>\"\",ROW($DL$3:$DL$28)-2),ROWS($DL$3:DL19))))","v":22},{"$f":"IF(DK19>=VLOOKUP(Wycena!$C$14,Mapping!$DG$3:$DI$5,3,0),DK19,\"\")","v":21},{"$f":"IF(ROWS($DN$3:DN19)>(ROWS($DN$3:$DN$28)-COUNTBLANK($DN$3:$DN$28)),\"\",INDEX($DN$3:$DN$28,SMALL(IF($DN$3:$DN$28<>\"\",ROW($DN$3:$DN$28)-2),ROWS($DN$3:DN19))))","v":22},null,null,null,21,{"$f":"IF(DS19>=VLOOKUP(Wycena!$C$25,Mapping!$DQ$3:$DR$4,2,0),DS19,\"\")","v":21},{"$f":"IF(ROWS($DT$3:DT19)>(ROWS($DT$3:$DT$28)-COUNTBLANK($DT$3:$DT$28)),\"\",INDEX($DT$3:$DT$28,SMALL(IF($DT$3:$DT$28<>\"\",ROW($DT$3:$DT$28)-2),ROWS($DT$3:DT19))))","v":26},null,16,null,null,null,null,null,null,null,null,null,null,null,null,null,null,null,null,null,null,null,null,null,null,null,null,null,null,null,null,null,null,null,null,null,"Ocja witraż nie powinna być dotępna dla w ościeżnicy nowoczesnej",null,null,null,null,null,null,null,null,null,16,{"$f":"IF(Wycena!$C$20=\"-\",\"\",FO19)","v":""},{"$f":"IF(ROWS($FP$3:FP19)>(ROWS($FP$3:$FP$23)-COUNTBLANK($FP$3:$FP$23)),\"\",INDEX($FP$3:$FP$23,SMALL(IF($FP$3:$FP$23<>\"\",ROW($FP$3:$FP$23)-2),ROWS($FP$3:FP19))))","v":""},{"$f":"IF(Wycena!$C$21=\"-\",\"\",FO19)","v":""},{"$f":"IF(ROWS($FR$3:FR19)>(ROWS($FR$3:$FR$23)-COUNTBLANK($FR$3:$FR$23)),\"\",INDEX($FR$3:$FR$23,SMALL(IF($FR$3:$FR$23<>\"\",ROW($FR$3:$FR$23)-2),ROWS($FR$3:FR19))))","v":""},{"$f":"IF(Wycena!$C$22=\"-\",\"\",FO19)","v":""},{"$f":"IF(ROWS($FT$3:FT19)>(ROWS($FT$3:$FT$23)-COUNTBLANK($FT$3:$FT$23)),\"\",INDEX($FT$3:$FT$23,SMALL(IF($FT$3:$FT$23<>\"\",ROW($FT$3:$FT$23)-2),ROWS($FT$3:FT19))))","v":""},null,"Brak (standard)","Automat 3-punktowy bez gałki","Automat 3-punktowy bez gałki",{"$f":"IF(OR(Wycena!$C$59=Mapping!$FW$5,Wycena!C59=Mapping!FW7,Wycena!C59=Mapping!FW8,Wycena!C59=Mapping!FW9,Wycena!C59=Mapping!FW10),0,400)","v":400},"Pochwyt Palermo w zestawie",1700,"Pochwyt Palermo w zestawie",{"$f":"IF(OR(Wycena!C60=Mapping!FY20,Wycena!C60=Mapping!FY17,Wycena!C60=\"-\"),\"\",GC19)","v":""},null,null,null,null,null,{"$f":"IF((HLOOKUP(VLOOKUP(Wycena!$C$59,Mapping!$GI$35:$GJ$43,2,0),$GD$1:$GI$33,2+GK19))=0,\"\",(HLOOKUP(VLOOKUP(Wycena!$C$59,Mapping!$GI$35:$GJ$43,2,0),$GD$1:$GI$33,2+GK19)))","v":""},17,{"$f":"IF(ROWS($GJ$3:GJ19)>(ROWS($GJ$3:$GJ$33)-COUNTBLANK($GJ$3:$GJ$33)),\"\",INDEX($GJ$3:$GJ$33,SMALL(IF($GJ$3:$GJ$33<>\"\",ROW($GJ$3:$GJ$33)-2),ROWS($GJ$3:GJ19))))","v":{"$error":"#N/A"}},"Klamka AXA Haga Plus","Czarny",null,null,null,null,null,null,null,null,"Zestaw elektronik z zamkiem automatycznym","-",null,null,null,null,null,null,null,null,null,null,null,null,null,null,null,null,null,null,null,null,35,{"$f":"3*110+70","v":400},{"$f":"(1+IFERROR(VLOOKUP(Wycena!$C$45,Mapping!$EZ$3:$FC$6,4,1),0)+IFERROR(VLOOKUP(Wycena!$C$49,Mapping!$EZ$3:$FC$6,4,1),0))*HT19","v":400},null,null,null,null,null,null,null,null,null,null,null,null,null,null,null,null,null,null,null,null,null,null,null,null,null,null,null,null,null,1700]
["DB 32",20,20,20,20,34,34,36,36,null,null,null,null,null,null,null,"Dąb sękaty poprzeczny","tak",null,null,null,null,null,null,"RAL 7047",0,"RAL 7047",{"$f":"IF((VLOOKUP(Wycena!$C$7,Mapping!$Q$15:$R$20,2,0))=\"tak\",\"\",AA20)","v":"RAL 7047"},{"$f":"IF(ROWS($AB$3:AB20)>(ROWS($AB$3:$AB$229)-COUNTBLANK($AB$3:$AB$229)),\"\",INDEX($AB$3:$AB$229,SMALL(IF($AB$3:$AB$229<>\"\",ROW($AB$3:$AB$229)-2),ROWS($AB$3:AB20))))","v":{"$error":"#N/A"}},null,null,null,null,null,null,null,null,null,null,null,null,null,null,null,null,null,null,null,null,89,0,0,{"$f":"IF(Wycena!$C$16=78,Mapping!AY20,AZ20)","v":0},null,null,197,0,0,{"$f":"IF(Wycena!$C$16=78,Mapping!BE20,BF20)","v":0},null,null,null,null,null,null,null,null,null,null,null,null,null,null,null,null,null,null,null,null,null,null,null,null,null,null,null,null,null,null,null,null,null,"Przy skrzydle i ościeżnicy od zewnątrz",null,{"$f":"IF(Wycena!$C$14=\"Przylgowe\",8,IF(Wycena!$C$14=\"Bezprzylgowe\",6,0))","v":8},{"$f":"IF(Wycena!$C$14=\"Przylgowe\",8,IF(Wycena!$C$14=\"Bezprzylgowe\",6,0))","v":8},{"$f":"IF(Wycena!$C$14=\"Przylgowe\",8,IF(Wycena!$C$14=\"Bezprzylgowe\",6,0))","v":8},null,null,null,null,null,null,null,22,{"$f":"IF(DA20>=VLOOKUP(Wycena!$C$14,Mapping!$CY$3:$CZ$5,2,0),DA20,\"\")","v":22},{"$f":"IF(ROWS($DB$3:DB20)>(ROWS($DB$3:$DB$28)-COUNTBLANK($DB$3:$DB$28)),\"\",INDEX($DB$3:$DB$28,SMALL(IF($DB$3:$DB$28<>\"\",ROW($DB$3:$DB$28)-2),ROWS($DB$3:DB20))))","v":23},null,null,null,null,null,null,null,22,{"$f":"IF(DK20>=VLOOKUP(Wycena!$C$14,Mapping!$DG$3:$DH$5,2,0),DK20,\"\")","v":22},{"$f":"IF(ROWS($DL$3:DL20)>(ROWS($DL$3:$DL$28)-COUNTBLANK($DL$3:$DL$28)),\"\",INDEX($DL$3:$DL$28,SMALL(IF($DL$3:$DL$28<>\"\",ROW($DL$3:$DL$28)-2),ROWS($DL$3:DL20))))","v":23},{"$f":"IF(DK20>=VLOOKUP(Wycena!$C$14,Mapping!$DG$3:$DI$5,3,0),DK20,\"\")","v":22},{"$f":"IF(ROWS($DN$3:DN20)>(ROWS($DN$3:$DN$28)-COUNTBLANK($DN$3:$DN$28)),\"\",INDEX($DN$3:$DN$28,SMALL(IF($DN$3:$DN$28<>\"\",ROW($DN$3:$DN$28)-2),ROWS($DN$3:DN20))))","v":23},null,null,null,22,{"$f":"IF(DS20>=VLOOKUP(Wycena!$C$25,Mapping!$DQ$3:$DR$4,2,0),DS20,\"\")","v":22},{"$f":"IF(ROWS($DT$3:DT20)>(ROWS($DT$3:$DT$28)-COUNTBLANK($DT$3:$DT$28)),\"\",INDEX($DT$3:$DT$28,SMALL(IF($DT$3:$DT$28<>\"\",ROW($DT$3:$DT$28)-2),ROWS($DT$3:DT20))))","v":27},null,17,null,null,null,null,null,null,null,null,null,null,null,null,null,null,null,null,null,null,null,null,null,null,null,null,null,null,null,null,null,null,null,null,null,"Opcja dyskretne - tylko dla imitacji skrzydła",null,null,null,null,null,null,null,null,null,17,{"$f":"IF(Wycena!$C$20=\"-\",\"\",FO20)","v":""},{"$f":"IF(ROWS($FP$3:FP20)>(ROWS($FP$3:$FP$23)-COUNTBLANK($FP$3:$FP$23)),\"\",INDEX($FP$3:$FP$23,SMALL(IF($FP$3:$FP$23<>\"\",ROW($FP$3:$FP$23)-2),ROWS($FP$3:FP20))))","v":""},{"$f":"IF(Wycena!$C$21=\"-\",\"\",FO20)","v":""},{"$f":"IF(ROWS($FR$3:FR20)>(ROWS($FR$3:$FR$23)-COUNTBLANK($FR$3:$FR$23)),\"\",INDEX($FR$3:$FR$23,SMALL(IF($FR$3:$FR$23<>\"\",ROW($FR$3:$FR$23)-2),ROWS($FR$3:FR20))))","v":""},{"$f":"IF(Wycena!$C$22=\"-\",\"\",FO20)","v":""},{"$f":"IF(ROWS($FT$3:FT20)>(ROWS($FT$3:$FT$23)-COUNTBLANK($FT$3:$FT$23)),\"\",INDEX($FT$3:$FT$23,SMALL(IF($FT$3:$FT$23<>\"\",ROW($FT$3:$FT$23)-2),ROWS($FT$3:FT20))))","v":""},null,"Brak (standard)","Automat 4-punktowy","Automat 4-punktowy",{"$f":"600-IF(Wycena!C59=Mapping!FY31,600,0)-IF(Wycena!C59=Mapping!FY30,300,0)","v":600},"Pochwyt Eva",0,"Pochwyt Eva",null,null,null,{"$f":"GC20","v":"Pochwyt Eva"},null,null,{"$f":"IF((HLOOKUP(VLOOKUP(Wycena!$C$59,Mapping!$GI$35:$GJ$43,2,0),$GD$1:$GI$33,2+GK20))=0,\"\",(HLOOKUP(VLOOKUP(Wycena!$C$59,Mapping!$GI$35:$GJ$43,2,0),$GD$1:$GI$33,2+GK20)))","v":""},18,{"$f":"IF(ROWS($GJ$3:GJ20)>(ROWS($GJ$3:$GJ$33)-COUNTBLANK($GJ$3:$GJ$33)),\"\",INDEX($GJ$3:$GJ$33,SMALL(IF($GJ$3:$GJ$33<>\"\",ROW($GJ$3:$GJ$33)-2),ROWS($GJ$3:GJ20))))","v":{"$error":"#N/A"}},"Klamka AXA Manitoba Plus","Inox",null,null,null,null,null,null,null,null,"Zestaw z pochwytem na styl amerykański","-",null,null,null,null,null,null,null,null,null,null,null,null,null,null,null,null,null,null,null,null,40,{"$f":"4*110","v":440},{"$f":"(1+IFERROR(VLOOKUP(Wycena!$C$45,Mapping!$EZ$3:$FC$6,4,1),0)+IFERROR(VLOOKUP(Wycena!$C$49,Mapping!$EZ$3:$FC$6,4,1),0))*HT20","v":440},null,null,null,null,null,null,null,null,null,null,null,null,null,null,null,null,null,null,null,null,null,null,null,null,null,null,null,null,null,1800]
["DB 33",20,20,20,20,34,34,36,36,null,null,null,null,null,null,null,null,null,null,null,null,null,null,null,"--- RAL inny ---",500,{"$f":"Y21","v":"--- RAL inny ---"},{"$f":"IF((VLOOKUP(Wycena!$C$7,Mapping!$Q$15:$R$20,2,0))=\"tak\",\"\",AA21)","v":"--- RAL inny ---"},{"$f":"IF(ROWS($AB$3:AB21)>(ROWS($AB$3:$AB$229)-COUNTBLANK($AB$3:$AB$229)),\"\",INDEX($AB$3:$AB$229,SMALL(IF($AB$3:$AB$229<>\"\",ROW($AB$3:$AB$229)-2),ROWS($AB$3:AB21))))","v":{"$error":"#N/A"}},null,null,null,null,null,null,null,null,null,null,null,null,null,null,null,null,null,null,null,null,90,0,0,{"$f":"IF(Wycena!$C$16=78,Mapping!AY21,AZ21)","v":0},null,null,198,0,0,{"$f":"IF(Wycena!$C$16=78,Mapping!BE21,BF21)","v":0},null,null,null,null,null,null,null,null,null,null,null,null,null,null,null,null,null,null,null,null,null,null,null,null,null,null,null,null,null,null,null,null,null,"Przy skrzydle i ościeżnicy z dwóch stron",null,{"$f":"IF(Wycena!$C$14=\"Przylgowe\",8,IF(Wycena!$C$14=\"Bezprzylgowe\",6,0))","v":8},{"$f":"IF(Wycena!$C$14=\"Przylgowe\",8,IF(Wycena!$C$14=\"Bezprzylgowe\",6,0))","v":8},{"$f":"IF(Wycena!$C$14=\"Przylgowe\",8,IF(Wycena!$C$14=\"Bezprzylgowe\",6,0))","v":8},null,null,null,null,null,null,null,23,{"$f":"IF(DA21>=VLOOKUP(Wycena!$C$14,Mapping!$CY$3:$CZ$5,2,0),DA21,\"\")","v":23},{"$f":"IF(ROWS($DB$3:DB21)>(ROWS($DB$3:$DB$28)-COUNTBLANK($DB$3:$DB$28)),\"\",INDEX($DB$3:$DB$28,SMALL(IF($DB$3:$DB$28<>\"\",ROW($DB$3:$DB$28)-2),ROWS($DB$3:DB21))))","v":24},null,null,null,"DB 223",12,null,null,23,{"$f":"IF(DK21>=VLOOKUP(Wycena!$C$14,Mapping!$DG$3:$DH$5,2,0),DK21,\"\")","v":23},{"$f":"IF(ROWS($DL$3:DL21)>(ROWS($DL$3:$DL$28)-COUNTBLANK($DL$3:$DL$28)),\"\",INDEX($DL$3:$DL$28,SMALL(IF($DL$3:$DL$28<>\"\",ROW($DL$3:$DL$28)-2),ROWS($DL$3:DL21))))","v":24},{"$f":"IF(DK21>=VLOOKUP(Wycena!$C$14,Mapping!$DG$3:$DI$5,3,0),DK21,\"\")","v":23},{"$f":"IF(ROWS($DN$3:DN21)>(ROWS($DN$3:$DN$28)-COUNTBLANK($DN$3:$DN$28)),\"\",INDEX($DN$3:$DN$28,SMALL(IF($DN$3:$DN$28<>\"\",ROW($DN$3:$DN$28)-2),ROWS($DN$3:DN21))))","v":24},null,null,null,23,{"$f":"IF(DS21>=VLOOKUP(Wycena!$C$25,Mapping!$DQ$3:$DR$4,2,0),DS21,\"\")","v":23},{"$f":"IF(ROWS($DT$3:DT21)>(ROWS($DT$3:$DT$28)-COUNTBLANK($DT$3:$DT$28)),\"\",INDEX($DT$3:$DT$28,SMALL(IF($DT$3:$DT$28<>\"\",ROW($DT$3:$DT$28)-2),ROWS($DT$3:DT21))))","v":28},null,18,null,null,null,null,null,null,null,null,null,null,null,null,null,null,null,null,null,null,null,null,null,null,null,null,null,null,null,null,null,null,null,null,null,null,null,null,null,null,null,null,null,null,null,18,{"$f":"IF(Wycena!$C$20=\"-\",\"\",FO21)","v":""},{"$f":"IF(ROWS($FP$3:FP21)>(ROWS($FP$3:$FP$23)-COUNTBLANK($FP$3:$FP$23)),\"\",INDEX($FP$3:$FP$23,SMALL(IF($FP$3:$FP$23<>\"\",ROW($FP$3:$FP$23)-2),ROWS($FP$3:FP21))))","v":""},{"$f":"IF(Wycena!$C$21=\"-\",\"\",FO21)","v":""},{"$f":"IF(ROWS($FR$3:FR21)>(ROWS($FR$3:$FR$23)-COUNTBLANK($FR$3:$FR$23)),\"\",INDEX($FR$3:$FR$23,SMALL(IF($FR$3:$FR$23<>\"\",ROW($FR$3:$FR$23)-2),ROWS($FR$3:FR21))))","v":""},{"$f":"IF(Wycena!$C$22=\"-\",\"\",FO21)","v":""},{"$f":"IF(ROWS($FT$3:FT21)>(ROWS($FT$3:$FT$23)-COUNTBLANK($FT$3:$FT$23)),\"\",INDEX($FT$3:$FT$23,SMALL(IF($FT$3:$FT$23<>\"\",ROW($FT$3:$FT$23)-2),ROWS($FT$3:FT21))))","v":""},null,"Brak (standard)","Automat ADR 5-punktowy z gałką","Automat ADR 5-punktowy z gałką",{"$f":"IFERROR(IF(VLOOKUP(Wycena!C59,Mapping!$FY$26:$FZ$29,2,0)>0,0,800),800)","v":800},"Pochwyt Maddalena",0,"Pochwyt Maddalena",null,null,null,{"$f":"GC21","v":"Pochwyt Maddalena"},null,null,{"$f":"IF((HLOOKUP(VLOOKUP(Wycena!$C$59,Mapping!$GI$35:$GJ$43,2,0),$GD$1:$GI$33,2+GK21))=0,\"\",(HLOOKUP(VLOOKUP(Wycena!$C$59,Mapping!$GI$35:$GJ$43,2,0),$GD$1:$GI$33,2+GK21)))","v":""},19,{"$f":"IF(ROWS($GJ$3:GJ21)>(ROWS($GJ$3:$GJ$33)-COUNTBLANK($GJ$3:$GJ$33)),\"\",INDEX($GJ$3:$GJ$33,SMALL(IF($GJ$3:$GJ$33<>\"\",ROW($GJ$3:$GJ$33)-2),ROWS($GJ$3:GJ21))))","v":{"$error":"#N/A"}},null,null,null,null,null,null,null,null,null,null,"Zestaw antywłamaniowy RC2","-",null,null,null,null,null,null,null,null,null,null,null,null,null,null,null,null,null,null,null,null,"x","x","x",null,null,null,null,null,null,null,null,null,null,null,null,null,null,null,null,null,null,null,null,null,null,null,null,null,null,null,null,null,1900]
["DB 34",20,20,20,20,34,34,36,36,null,null,null,null,null,null,null,null,null,null,null,null,null,null,null,"RAL 1000",500,"RAL 1000",{"$f":"IF((VLOOKUP(Wycena!$C$7,Mapping!$Q$15:$R$20,2,0))=\"tak\",\"\",AA22)","v":"RAL 1000"},{"$f":"IF(ROWS($AB$3:AB22)>(ROWS($AB$3:$AB$229)-COUNTBLANK($AB$3:$AB$229)),\"\",INDEX($AB$3:$AB$229,SMALL(IF($AB$3:$AB$229<>\"\",ROW($AB$3:$AB$229)-2),ROWS($AB$3:AB22))))","v":{"$error":"#N/A"}},null,null,null,null,null,null,null,null,null,null,null,null,null,null,null,null,null,null,null,null,91,0,0,{"$f":"IF(Wycena!$C$16=78,Mapping!AY22,AZ22)","v":0},null,null,199,0,0,{"$f":"IF(Wycena!$C$16=78,Mapping!BE22,BF22)","v":0},null,null,null,null,null,null,null,null,null,null,null,null,null,null,null,null,null,null,null,null,null,null,null,null,null,null,null,null,null,null,null,null,null,"Przy skrzydle i naświetlu od zewnątrz",{"$f":"IF(Wycena!$C$14=\"Przylgowe\",8,IF(Wycena!$C$14=\"Bezprzylgowe\",6,0))","v":8},0,{"$f":"IF(Wycena!$C$14=\"Przylgowe\",8,IF(Wycena!$C$14=\"Bezprzylgowe\",6,0))","v":8},0,null,null,null,null,null,null,null,24,{"$f":"IF(DA22>=VLOOKUP(Wycena!$C$14,Mapping!$CY$3:$CZ$5,2,0),DA22,\"\")","v":24},{"$f":"IF(ROWS($DB$3:DB22)>(ROWS($DB$3:$DB$28)-COUNTBLANK($DB$3:$DB$28)),\"\",INDEX($DB$3:$DB$28,SMALL(IF($DB$3:$DB$28<>\"\",ROW($DB$3:$DB$28)-2),ROWS($DB$3:DB22))))","v":25},null,null,null,"DB 154",9,{"$f":"IF(OR(Wycena!$C$20=\"-\",Wycena!$C$20=\"Imitacja skrzydła ruchoma\"),(MAX((IFERROR(VLOOKUP(Wycena!C5,Mapping!$DG$21:$DH$23,2,0),0)),(VLOOKUP(Wycena!$C$25,Mapping!$CW$3:$CX$4,2,0)+VLOOKUP(Wycena!C26,$CO$16:$CS$25,IF(AND(Wycena!C20=\"-\",Wycena!C21=\"-\"),2,IF(AND(Wycena!C20<>\"-\",Wycena!C21=\"-\"),3,IF(AND(Wycena!C20=\"-\",Wycena!C21<>\"-\"),4,5))),0)))),(VLOOKUP(Wycena!$C$25,Mapping!$CW$3:$CX$4,2,0)+VLOOKUP(Wycena!C26,$CO$16:$CS$25,IF(AND(Wycena!C20=\"-\",Wycena!C21=\"-\"),2,IF(AND(Wycena!C20<>\"-\",Wycena!C21=\"-\"),3,IF(AND(Wycena!C20=\"-\",Wycena!C21<>\"-\"),4,5))),0)))","v":6},{"$f":"IF(Wycena!$C$21=\"Imitacja skrzydła ruchoma\",(MAX((IFERROR(VLOOKUP(Wycena!C5,Mapping!$DG$21:$DH$23,2,0),0)),(VLOOKUP(Wycena!$C$25,Mapping!$CW$3:$CX$4,2,0)+VLOOKUP(Wycena!C26,$CO$28:$CS$37,IF(AND(Wycena!C20=\"-\",Wycena!C21=\"-\"),2,IF(AND(Wycena!C20<>\"-\",Wycena!C21=\"-\"),3,IF(AND(Wycena!C20=\"-\",Wycena!C21<>\"-\"),4,5))),0)))),(VLOOKUP(Wycena!$C$25,Mapping!$CW$3:$CX$4,2,0)+VLOOKUP(Wycena!C26,$CO$28:$CS$37,IF(AND(Wycena!C20=\"-\",Wycena!C21=\"-\"),2,IF(AND(Wycena!C20<>\"-\",Wycena!C21=\"-\"),3,IF(AND(Wycena!C20=\"-\",Wycena!C21<>\"-\"),4,5))),0)))","v":6},24,{"$f":"IF(DK22>=VLOOKUP(Wycena!$C$14,Mapping!$DG$3:$DH$5,2,0),DK22,\"\")","v":24},{"$f":"IF(ROWS($DL$3:DL22)>(ROWS($DL$3:$DL$28)-COUNTBLANK($DL$3:$DL$28)),\"\",INDEX($DL$3:$DL$28,SMALL(IF($DL$3:$DL$28<>\"\",ROW($DL$3:$DL$28)-2),ROWS($DL$3:DL22))))","v":25},{"$f":"IF(DK22>=VLOOKUP(Wycena!$C$14,Mapping!$DG$3:$DI$5,3,0),DK22,\"\")","v":24},{"$f":"IF(ROWS($DN$3:DN22)>(ROWS($DN$3:$DN$28)-COUNTBLANK($DN$3:$DN$28)),\"\",INDEX($DN$3:$DN$28,SMALL(IF($DN$3:$DN$28<>\"\",ROW($DN$3:$DN$28)-2),ROWS($DN$3:DN22))))","v":25},null,null,null,24,{"$f":"IF(DS22>=VLOOKUP(Wycena!$C$25,Mapping!$DQ$3:$DR$4,2,0),DS22,\"\")","v":24},{"$f":"IF(ROWS($DT$3:DT22)>(ROWS($DT$3:$DT$28)-COUNTBLANK($DT$3:$DT$28)),\"\",INDEX($DT$3:$DT$28,SMALL(IF($DT$3:$DT$28<>\"\",ROW($DT$3:$DT$28)-2),ROWS($DT$3:DT22))))","v":29},null,19,null,null,null,null,null,null,null,null,null,null,null,null,null,null,null,null,null,null,null,null,null,null,null,null,null,null,null,null,null,null,null,null,null,null,null,null,null,null,null,null,null,null,null,19,{"$f":"IF(Wycena!$C$20=\"-\",\"\",FO22)","v":""},{"$f":"IF(ROWS($FP$3:FP22)>(ROWS($FP$3:$FP$23)-COUNTBLANK($FP$3:$FP$23)),\"\",INDEX($FP$3:$FP$23,SMALL(IF($FP$3:$FP$23<>\"\",ROW($FP$3:$FP$23)-2),ROWS($FP$3:FP22))))","v":""},{"$f":"IF(Wycena!$C$21=\"-\",\"\",FO22)","v":""},{"$f":"IF(ROWS($FR$3:FR22)>(ROWS($FR$3:$FR$23)-COUNTBLANK($FR$3:$FR$23)),\"\",INDEX($FR$3:$FR$23,SMALL(IF($FR$3:$FR$23<>\"\",ROW($FR$3:$FR$23)-2),ROWS($FR$3:FR22))))","v":""},{"$f":"IF(Wycena!$C$22=\"-\",\"\",FO22)","v":""},{"$f":"IF(ROWS($FT$3:FT22)>(ROWS($FT$3:$FT$23)-COUNTBLANK($FT$3:$FT$23)),\"\",INDEX($FT$3:$FT$23,SMALL(IF($FT$3:$FT$23<>\"\",ROW($FT$3:$FT$23)-2),ROWS($FT$3:FT22))))","v":""},null,"Brak (standard)","Automat ADR 5-punktowy bez gałki","Automat ADR 5-punktowy bez gałki",{"$f":"IFERROR(IF(VLOOKUP(Wycena!C59,Mapping!$FY$26:$FZ$29,2,0)>0,0,800),800)","v":800},"Antaba Medos Lisbon prostokątna prosta + klamka Warszawa",900,{"$f":"IF(VLOOKUP(Wycena!$C$5,SKU!$B$1:$D$743,3,0)=\"Płytowe\",GA22,\"\")","v":{"$error":"#N/A"}},{"$f":"GC22","v":{"$error":"#N/A"}},{"$f":"GC22","v":{"$error":"#N/A"}},{"$f":"GC22","v":{"$error":"#N/A"}},null,null,{"$f":"GC22","v":{"$error":"#N/A"}},{"$f":"IF((HLOOKUP(VLOOKUP(Wycena!$C$59,Mapping!$GI$35:$GJ$43,2,0),$GD$1:$GI$33,2+GK22))=0,\"\",(HLOOKUP(VLOOKUP(Wycena!$C$59,Mapping!$GI$35:$GJ$43,2,0),$GD$1:$GI$33,2+GK22)))","v":{"$error":"#N/A"}},20,{"$f":"IF(ROWS($GJ$3:GJ22)>(ROWS($GJ$3:$GJ$33)-COUNTBLANK($GJ$3:$GJ$33)),\"\",INDEX($GJ$3:$GJ$33,SMALL(IF($GJ$3:$GJ$33<>\"\",ROW($GJ$3:$GJ$33)-2),ROWS($GJ$3:GJ22))))","v":{"$error":"#N/A"}},"Klamka AXA Manitoba Plus","Stare złoto",null,null,null,null,null,null,null,null,"Zestaw czytnik linii papilarnych","-",null,null,null,null,null,null,null,null,null,null,null,null,null,null,null,null,null,null,null,null,null,null,null,null,null,null,null,null,null,null,null,null,null,null,null,null,null,null,null,null,null,null,null,null,null,null,null,null,null,null,null,null,2000]
["DB 39",20,20,48,48,50,50,50,50,null,null,null,null,null,null,null,null,null,null,null,null,null,null,null,"RAL 1001",500,"RAL 1001",{"$f":"IF((VLOOKUP(Wycena!$C$7,Mapping!$Q$15:$R$20,2,0))=\"tak\",\"\",AA23)","v":"RAL 1001"},{"$f":"IF(ROWS($AB$3:AB23)>(ROWS($AB$3:$AB$229)-COUNTBLANK($AB$3:$AB$229)),\"\",INDEX($AB$3:$AB$229,SMALL(IF($AB$3:$AB$229<>\"\",ROW($AB$3:$AB$229)-2),ROWS($AB$3:AB23))))","v":{"$error":"#N/A"}},null,null,null,null,null,null,null,null,null,null,null,null,null,null,null,null,null,null,null,null,92,0,0,{"$f":"IF(Wycena!$C$16=78,Mapping!AY23,AZ23)","v":0},null,null,200,0,0,{"$f":"IF(Wycena!$C$16=78,Mapping!BE23,BF23)","v":0},null,null,null,null,null,null,null,null,null,null,null,null,null,null,null,null,null,null,null,null,null,null,null,null,null,null,null,null,null,null,null,null,null,"Przy skrzydle i naświetlu z dwóch stron",{"$f":"IF(Wycena!$C$14=\"Przylgowe\",8,IF(Wycena!$C$14=\"Bezprzylgowe\",6,0))","v":8},0,{"$f":"IF(Wycena!$C$14=\"Przylgowe\",8,IF(Wycena!$C$14=\"Bezprzylgowe\",6,0))","v":8},0,null,null,null,null,null,null,null,25,{"$f":"IF(DA23>=VLOOKUP(Wycena!$C$14,Mapping!$CY$3:$CZ$5,2,0),DA23,\"\")","v":25},{"$f":"IF(ROWS($DB$3:DB23)>(ROWS($DB$3:$DB$28)-COUNTBLANK($DB$3:$DB$28)),\"\",INDEX($DB$3:$DB$28,SMALL(IF($DB$3:$DB$28<>\"\",ROW($DB$3:$DB$28)-2),ROWS($DB$3:DB23))))","v":26},null,null,null,"DB 157",9,{"$f":"IF(OR(Wycena!$C$20=\"-\",Wycena!$C$20=\"Imitacja skrzydła ruchoma\"),(MAX((IFERROR(VLOOKUP(Wycena!C5,Mapping!$DG$21:$DH$23,2,0),0)),(8+VLOOKUP(Wycena!C26,$CO$16:$CS$25,IF(AND(Wycena!C20=\"-\",Wycena!C21=\"-\"),2,IF(AND(Wycena!C20<>\"-\",Wycena!C21=\"-\"),3,IF(AND(Wycena!C20=\"-\",Wycena!C21<>\"-\"),4,5))),0)))),(8+VLOOKUP(Wycena!C26,$CO$16:$CS$25,IF(AND(Wycena!C20=\"-\",Wycena!C21=\"-\"),2,IF(AND(Wycena!C20<>\"-\",Wycena!C21=\"-\"),3,IF(AND(Wycena!C20=\"-\",Wycena!C21<>\"-\"),4,5))),0)))","v":8},{"$f":"IF(Wycena!$C$21=\"Imitacja skrzydła ruchoma\",(MAX((IFERROR(VLOOKUP(Wycena!C5,Mapping!$DG$21:$DH$23,2,0),0)),(8+VLOOKUP(Wycena!C26,$CO$28:$CS$37,IF(AND(Wycena!C20=\"-\",Wycena!C21=\"-\"),2,IF(AND(Wycena!C20<>\"-\",Wycena!C21=\"-\"),3,IF(AND(Wycena!C20=\"-\",Wycena!C21<>\"-\"),4,5))),0)))),(8+VLOOKUP(Wycena!C26,$CO$28:$CS$37,IF(AND(Wycena!C20=\"-\",Wycena!C21=\"-\"),2,IF(AND(Wycena!C20<>\"-\",Wycena!C21=\"-\"),3,IF(AND(Wycena!C20=\"-\",Wycena!C21<>\"-\"),4,5))),0)))","v":8},25,{"$f":"IF(DK23>=VLOOKUP(Wycena!$C$14,Mapping!$DG$3:$DH$5,2,0),DK23,\"\")","v":25},{"$f":"IF(ROWS($DL$3:DL23)>(ROWS($DL$3:$DL$28)-COUNTBLANK($DL$3:$DL$28)),\"\",INDEX($DL$3:$DL$28,SMALL(IF($DL$3:$DL$28<>\"\",ROW($DL$3:$DL$28)-2),ROWS($DL$3:DL23))))","v":26},{"$f":"IF(DK23>=VLOOKUP(Wycena!$C$14,Mapping!$DG$3:$DI$5,3,0),DK23,\"\")","v":25},{"$f":"IF(ROWS($DN$3:DN23)>(ROWS($DN$3:$DN$28)-COUNTBLANK($DN$3:$DN$28)),\"\",INDEX($DN$3:$DN$28,SMALL(IF($DN$3:$DN$28<>\"\",ROW($DN$3:$DN$28)-2),ROWS($DN$3:DN23))))","v":26},null,null,null,25,{"$f":"IF(DS23>=VLOOKUP(Wycena!$C$25,Mapping!$DQ$3:$DR$4,2,0),DS23,\"\")","v":25},{"$f":"IF(ROWS($DT$3:DT23)>(ROWS($DT$3:$DT$28)-COUNTBLANK($DT$3:$DT$28)),\"\",INDEX($DT$3:$DT$28,SMALL(IF($DT$3:$DT$28<>\"\",ROW($DT$3:$DT$28)-2),ROWS($DT$3:DT23))))","v":30},null,20,null,null,null,null,null,null,null,null,null,null,null,null,null,null,null,null,null,null,null,null,null,null,null,null,null,null,null,null,null,null,null,null,null,null,null,null,null,null,null,null,null,null,null,20,{"$f":"IF(Wycena!$C$20=\"-\",\"\",FO23)","v":""},{"$f":"IF(ROWS($FP$3:FP23)>(ROWS($FP$3:$FP$23)-COUNTBLANK($FP$3:$FP$23)),\"\",INDEX($FP$3:$FP$23,SMALL(IF($FP$3:$FP$23<>\"\",ROW($FP$3:$FP$23)-2),ROWS($FP$3:FP23))))","v":""},{"$f":"IF(Wycena!$C$21=\"-\",\"\",FO23)","v":""},{"$f":"IF(ROWS($FR$3:FR23)>(ROWS($FR$3:$FR$23)-COUNTBLANK($FR$3:$FR$23)),\"\",INDEX($FR$3:$FR$23,SMALL(IF($FR$3:$FR$23<>\"\",ROW($FR$3:$FR$23)-2),ROWS($FR$3:FR23))))","v":""},{"$f":"IF(Wycena!$C$22=\"-\",\"\",FO23)","v":""},{"$f":"IF(ROWS($FT$3:FT23)>(ROWS($FT$3:$FT$23)-COUNTBLANK($FT$3:$FT$23)),\"\",INDEX($FT$3:$FT$23,SMALL(IF($FT$3:$FT$23<>\"\",ROW($FT$3:$FT$23)-2),ROWS($FT$3:FT23))))","v":""},null,"Zestaw elektronik z zamkiem ryglowym","Ryglowy 3-punktowy z gałką (standard)","Pojedynczy jedna wkładka",0,"Antaba Medos Lisbon prostokątna skośna + klamka Warszawa",1000,{"$f":"IF(VLOOKUP(Wycena!$C$5,SKU!$B$1:$D$743,3,0)=\"Płycinowe\",GA23,\"\")","v":{"$error":"#N/A"}},{"$error":"#N/A"},{"$f":"GC23","v":{"$error":"#N/A"}},{"$error":"#N/A"},null,null,{"$f":"GC23","v":{"$error":"#N/A"}},{"$f":"IF((HLOOKUP(VLOOKUP(Wycena!$C$59,Mapping!$GI$35:$GJ$43,2,0),$GD$1:$GI$33,2+GK23))=0,\"\",(HLOOKUP(VLOOKUP(Wycena!$C$59,Mapping!$GI$35:$GJ$43,2,0),$GD$1:$GI$33,2+GK23)))","v":{"$error":"#N/A"}},21,{"$f":"IF(ROWS($GJ$3:GJ23)>(ROWS($GJ$3:$GJ$33)-COUNTBLANK($GJ$3:$GJ$33)),\"\",INDEX($GJ$3:$GJ$33,SMALL(IF($GJ$3:$GJ$33<>\"\",ROW($GJ$3:$GJ$33)-2),ROWS($GJ$3:GJ23))))","v":{"$error":"#N/A"}},"Klamka AXA Niagara Plus","Inox",null,null,null,null,null,null,null,null,"Zestaw czytnik linii papilarnych dLine","-",null,null,null,"Po zestawie",null,null,null,null,null,null,null,null,null,null,null,null,null,null,null,null,null,null,null,null,null,null,null,null,null,null,null,null,null,null,null,null,null,null,null,null,null,null,null,null,null,null,null,null,null,null,null,null,2100]
["DB 43",20,20,20,20,34,34,{"$f":"F24+2","v":36},{"$f":"G24+2","v":36},null,null,null,null,null,null,null,null,null,null,null,null,null,null,null,"RAL 1002",500,"RAL 1002",{"$f":"IF((VLOOKUP(Wycena!$C$7,Mapping!$Q$15:$R$20,2,0))=\"tak\",\"\",AA24)","v":"RAL 1002"},{"$f":"IF(ROWS($AB$3:AB24)>(ROWS($AB$3:$AB$229)-COUNTBLANK($AB$3:$AB$229)),\"\",INDEX($AB$3:$AB$229,SMALL(IF($AB$3:$AB$229<>\"\",ROW($AB$3:$AB$229)-2),ROWS($AB$3:AB24))))","v":{"$error":"#N/A"}},null,null,null,null,null,null,null,null,null,null,null,null,null,null,null,null,null,null,null,null,93,0,0,{"$f":"IF(Wycena!$C$16=78,Mapping!AY24,AZ24)","v":0},null,null,201,0,0,{"$f":"IF(Wycena!$C$16=78,Mapping!BE24,BF24)","v":0},null,null,null,null,null,null,null,null,null,null,null,null,null,null,null,null,null,null,null,null,null,null,null,null,null,null,null,null,null,null,null,null,null,"Przy skrzydle, naświetlu i ościeżnicy od zewnątrz",null,{"$f":"IF(Wycena!$C$14=\"Przylgowe\",8,IF(Wycena!$C$14=\"Bezprzylgowe\",6,0))","v":8},{"$f":"IF(Wycena!$C$14=\"Przylgowe\",8,IF(Wycena!$C$14=\"Bezprzylgowe\",6,0))","v":8},{"$f":"IF(Wycena!$C$14=\"Przylgowe\",8,IF(Wycena!$C$14=\"Bezprzylgowe\",6,0))","v":8},null,null,null,null,null,null,null,26,{"$f":"IF(DA24>=VLOOKUP(Wycena!$C$14,Mapping!$CY$3:$CZ$5,2,0),DA24,\"\")","v":26},{"$f":"IF(ROWS($DB$3:DB24)>(ROWS($DB$3:$DB$28)-COUNTBLANK($DB$3:$DB$28)),\"\",INDEX($DB$3:$DB$28,SMALL(IF($DB$3:$DB$28<>\"\",ROW($DB$3:$DB$28)-2),ROWS($DB$3:DB24))))","v":27},null,null,null,null,null,null,null,26,{"$f":"IF(DK24>=VLOOKUP(Wycena!$C$14,Mapping!$DG$3:$DH$5,2,0),DK24,\"\")","v":26},{"$f":"IF(ROWS($DL$3:DL24)>(ROWS($DL$3:$DL$28)-COUNTBLANK($DL$3:$DL$28)),\"\",INDEX($DL$3:$DL$28,SMALL(IF($DL$3:$DL$28<>\"\",ROW($DL$3:$DL$28)-2),ROWS($DL$3:DL24))))","v":27},{"$f":"IF(DK24>=VLOOKUP(Wycena!$C$14,Mapping!$DG$3:$DI$5,3,0),DK24,\"\")","v":26},{"$f":"IF(ROWS($DN$3:DN24)>(ROWS($DN$3:$DN$28)-COUNTBLANK($DN$3:$DN$28)),\"\",INDEX($DN$3:$DN$28,SMALL(IF($DN$3:$DN$28<>\"\",ROW($DN$3:$DN$28)-2),ROWS($DN$3:DN24))))","v":27},null,null,null,26,{"$f":"IF(DS24>=VLOOKUP(Wycena!$C$25,Mapping!$DQ$3:$DR$4,2,0),DS24,\"\")","v":26},{"$f":"IF(ROWS($DT$3:DT24)>(ROWS($DT$3:$DT$28)-COUNTBLANK($DT$3:$DT$28)),\"\",INDEX($DT$3:$DT$28,SMALL(IF($DT$3:$DT$28<>\"\",ROW($DT$3:$DT$28)-2),ROWS($DT$3:DT24))))","v":""},null,21,null,null,null,null,null,null,null,null,null,null,null,null,null,null,null,null,null,null,null,null,null,null,null,null,null,null,null,null,null,null,null,null,null,null,null,null,null,null,null,null,null,null,null,"x","x","x","x","x","x",null,null,"Zestaw elektronik z zamkiem ryglowym","Ryglowy 3-punktowy bez gałki (standard)","Podwójny dwie wkładki",400,null,null,null,null,null,null,null,null,null,{"$f":"IF((HLOOKUP(VLOOKUP(Wycena!$C$59,Mapping!$GI$35:$GJ$43,2,0),$GD$1:$GI$33,2+GK24))=0,\"\",(HLOOKUP(VLOOKUP(Wycena!$C$59,Mapping!$GI$35:$GJ$43,2,0),$GD$1:$GI$33,2+GK24)))","v":""},22,{"$f":"IF(ROWS($GJ$3:GJ24)>(ROWS($GJ$3:$GJ$33)-COUNTBLANK($GJ$3:$GJ$33)),\"\",INDEX($GJ$3:$GJ$33,SMALL(IF($GJ$3:$GJ$33<>\"\",ROW($GJ$3:$GJ$33)-2),ROWS($GJ$3:GJ24))))","v":{"$error":"#N/A"}},null,null,null,null,null,null,null,null,null,null,"Zestaw UNILOCK","-",null,null,null,"Brak (standard)","-",null,null,null,null,null,null,null,null,null,null,null,null,null,null,null,null,null,null,null,null,null,null,null,null,null,null,null,null,null,null,null,null,null,null,null,null,null,null,null,null,null,null,null,null,null,null,null,2200]
["DB 45",20,20,20,20,34,34,36,36,null,null,null,null,null,null,null,null,null,null,null,null,null,null,null,"RAL 1003",500,"RAL 1003",{"$f":"IF((VLOOKUP(Wycena!$C$7,Mapping!$Q$15:$R$20,2,0))=\"tak\",\"\",AA25)","v":"RAL 1003"},{"$f":"IF(ROWS($AB$3:AB25)>(ROWS($AB$3:$AB$229)-COUNTBLANK($AB$3:$AB$229)),\"\",INDEX($AB$3:$AB$229,SMALL(IF($AB$3:$AB$229<>\"\",ROW($AB$3:$AB$229)-2),ROWS($AB$3:AB25))))","v":{"$error":"#N/A"}},null,null,null,null,null,null,null,null,null,null,null,null,null,null,null,null,null,null,null,null,94,0,0,{"$f":"IF(Wycena!$C$16=78,Mapping!AY25,AZ25)","v":0},null,null,202,0,0,{"$f":"IF(Wycena!$C$16=78,Mapping!BE25,BF25)","v":0},null,null,null,null,null,null,null,null,null,null,null,null,null,null,null,null,null,null,null,null,null,null,null,null,null,null,null,null,null,null,null,null,null,"Przy skrzydle, naświetlu i ościeżnicy z dwóch stron",null,{"$f":"IF(Wycena!$C$14=\"Przylgowe\",8,IF(Wycena!$C$14=\"Bezprzylgowe\",6,0))","v":8},{"$f":"IF(Wycena!$C$14=\"Przylgowe\",8,IF(Wycena!$C$14=\"Bezprzylgowe\",6,0))","v":8},{"$f":"IF(Wycena!$C$14=\"Przylgowe\",8,IF(Wycena!$C$14=\"Bezprzylgowe\",6,0))","v":8},null,null,null,null,null,null,null,27,{"$f":"IF(DA25>=VLOOKUP(Wycena!$C$14,Mapping!$CY$3:$CZ$5,2,0),DA25,\"\")","v":27},{"$f":"IF(ROWS($DB$3:DB25)>(ROWS($DB$3:$DB$28)-COUNTBLANK($DB$3:$DB$28)),\"\",INDEX($DB$3:$DB$28,SMALL(IF($DB$3:$DB$28<>\"\",ROW($DB$3:$DB$28)-2),ROWS($DB$3:DB25))))","v":28},null,null,null,null,null,null,null,27,{"$f":"IF(DK25>=VLOOKUP(Wycena!$C$14,Mapping!$DG$3:$DH$5,2,0),DK25,\"\")","v":27},{"$f":"IF(ROWS($DL$3:DL25)>(ROWS($DL$3:$DL$28)-COUNTBLANK($DL$3:$DL$28)),\"\",INDEX($DL$3:$DL$28,SMALL(IF($DL$3:$DL$28<>\"\",ROW($DL$3:$DL$28)-2),ROWS($DL$3:DL25))))","v":28},{"$f":"IF(DK25>=VLOOKUP(Wycena!$C$14,Mapping!$DG$3:$DI$5,3,0),DK25,\"\")","v":27},{"$f":"IF(ROWS($DN$3:DN25)>(ROWS($DN$3:$DN$28)-COUNTBLANK($DN$3:$DN$28)),\"\",INDEX($DN$3:$DN$28,SMALL(IF($DN$3:$DN$28<>\"\",ROW($DN$3:$DN$28)-2),ROWS($DN$3:DN25))))","v":28},null,null,null,27,{"$f":"IF(DS25>=VLOOKUP(Wycena!$C$25,Mapping!$DQ$3:$DR$4,2,0),DS25,\"\")","v":27},{"$f":"IF(ROWS($DT$3:DT25)>(ROWS($DT$3:$DT$28)-COUNTBLANK($DT$3:$DT$28)),\"\",INDEX($DT$3:$DT$28,SMALL(IF($DT$3:$DT$28<>\"\",ROW($DT$3:$DT$28)-2),ROWS($DT$3:DT25))))","v":""},null,22,null,null,null,null,null,null,null,null,null,null,null,null,null,null,null,null,null,null,null,null,null,null,null,null,null,null,null,null,null,null,null,null,null,null,null,null,null,null,null,null,null,null,null,null,null,null,null,null,null,null,null,"Zestaw elektronik z zamkiem ryglowym","Ryglowy 4-punktowy",null,null,null,null,null,null,null,null,null,null,null,{"$f":"IF((HLOOKUP(VLOOKUP(Wycena!$C$59,Mapping!$GI$35:$GJ$43,2,0),$GD$1:$GI$33,2+GK25))=0,\"\",(HLOOKUP(VLOOKUP(Wycena!$C$59,Mapping!$GI$35:$GJ$43,2,0),$GD$1:$GI$33,2+GK25)))","v":""},23,{"$f":"IF(ROWS($GJ$3:GJ25)>(ROWS($GJ$3:$GJ$33)-COUNTBLANK($GJ$3:$GJ$33)),\"\",INDEX($GJ$3:$GJ$33,SMALL(IF($GJ$3:$GJ$33<>\"\",ROW($GJ$3:$GJ$33)-2),ROWS($GJ$3:GJ25))))","v":{"$error":"#N/A"}},"Klamka AXA Niagara Plus","Stare złoto",null,null,null,null,null,null,null,null,"Zestaw UNILOCK WIFI","-",null,null,null,"Brak (standard)","Tak",null,null,null,null,null,null,null,null,null,null,null,null,null,null,null,null,null,null,null,null,null,null,null,null,null,null,null,null,null,null,null,null,null,null,null,null,null,null,null,null,null,null,null,null,null,null,null,2300]
["DB 47",20,20,20,20,34,34,36,36,null,null,null,null,null,null,null,null,null,null,null,null,null,null,null,"RAL 1004",500,"RAL 1004",{"$f":"IF((VLOOKUP(Wycena!$C$7,Mapping!$Q$15:$R$20,2,0))=\"tak\",\"\",AA26)","v":"RAL 1004"},{"$f":"IF(ROWS($AB$3:AB26)>(ROWS($AB$3:$AB$229)-COUNTBLANK($AB$3:$AB$229)),\"\",INDEX($AB$3:$AB$229,SMALL(IF($AB$3:$AB$229<>\"\",ROW($AB$3:$AB$229)-2),ROWS($AB$3:AB26))))","v":{"$error":"#N/A"}},null,null,null,null,null,null,null,null,null,null,null,null,null,null,null,null,null,null,null,null,95,0,0,{"$f":"IF(Wycena!$C$16=78,Mapping!AY26,AZ26)","v":0},null,null,203,0,0,{"$f":"IF(Wycena!$C$16=78,Mapping!BE26,BF26)","v":0},null,null,null,null,null,null,null,null,null,null,null,null,null,null,null,null,null,null,null,null,null,null,null,null,null,null,null,null,null,null,null,null,null,null,null,null,null,null,null,null,null,null,null,null,null,28,{"$f":"IF(DA26>=VLOOKUP(Wycena!$C$14,Mapping!$CY$3:$CZ$5,2,0),DA26,\"\")","v":28},{"$f":"IF(ROWS($DB$3:DB26)>(ROWS($DB$3:$DB$28)-COUNTBLANK($DB$3:$DB$28)),\"\",INDEX($DB$3:$DB$28,SMALL(IF($DB$3:$DB$28<>\"\",ROW($DB$3:$DB$28)-2),ROWS($DB$3:DB26))))","v":29},null,null,null,null,null,null,null,28,{"$f":"IF(DK26>=VLOOKUP(Wycena!$C$14,Mapping!$DG$3:$DH$5,2,0),DK26,\"\")","v":28},{"$f":"IF(ROWS($DL$3:DL26)>(ROWS($DL$3:$DL$28)-COUNTBLANK($DL$3:$DL$28)),\"\",INDEX($DL$3:$DL$28,SMALL(IF($DL$3:$DL$28<>\"\",ROW($DL$3:$DL$28)-2),ROWS($DL$3:DL26))))","v":29},{"$f":"IF(DK26>=VLOOKUP(Wycena!$C$14,Mapping!$DG$3:$DI$5,3,0),DK26,\"\")","v":28},{"$f":"IF(ROWS($DN$3:DN26)>(ROWS($DN$3:$DN$28)-COUNTBLANK($DN$3:$DN$28)),\"\",INDEX($DN$3:$DN$28,SMALL(IF($DN$3:$DN$28<>\"\",ROW($DN$3:$DN$28)-2),ROWS($DN$3:DN26))))","v":29},null,null,null,28,{"$f":"IF(DS26>=VLOOKUP(Wycena!$C$25,Mapping!$DQ$3:$DR$4,2,0),DS26,\"\")","v":28},{"$f":"IF(ROWS($DT$3:DT26)>(ROWS($DT$3:$DT$28)-COUNTBLANK($DT$3:$DT$28)),\"\",INDEX($DT$3:$DT$28,SMALL(IF($DT$3:$DT$28<>\"\",ROW($DT$3:$DT$28)-2),ROWS($DT$3:DT26))))","v":""},null,23,null,null,null,null,null,null,null,null,null,null,null,null,null,null,null,null,null,null,null,null,null,null,null,null,null,null,null,null,null,null,null,null,null,null,null,null,null,null,null,null,null,null,null,null,null,{"$f":"$FQ$3:INDEX($FQ$3:$FQ$23,(ROWS($FP$3:$FP$23)-COUNTBLANK($FP$3:$FP$23)))","v":"-"},null,{"$f":"$FS$3:INDEX($FS$3:$FS$23,(ROWS($FR$3:$FR$23)-COUNTBLANK($FR$3:$FR$23)))","v":"-"},null,{"$f":"$FU$3:INDEX($FU$3:$FU$23,(ROWS($FT$3:$FT$23)-COUNTBLANK($FT$3:$FT$23)))","v":"-"},null,"Zestaw elektronik z zamkiem automatycznym","Automat 3-punktowy z gałką","Zestaw czytnik linii papilarnych",1,"Antaba Medos Paris okrągła prosta + klamka Warszawa",900,{"$f":"IF(VLOOKUP(Wycena!$C$5,SKU!$B$1:$D$743,3,0)=\"Płytowe\",GA26,\"\")","v":{"$error":"#N/A"}},{"$error":"#N/A"},{"$error":"#N/A"},{"$error":"#N/A"},null,null,{"$error":"#N/A"},{"$f":"IF((HLOOKUP(VLOOKUP(Wycena!$C$59,Mapping!$GI$35:$GJ$43,2,0),$GD$1:$GI$33,2+GK26))=0,\"\",(HLOOKUP(VLOOKUP(Wycena!$C$59,Mapping!$GI$35:$GJ$43,2,0),$GD$1:$GI$33,2+GK26)))","v":{"$error":"#N/A"}},24,{"$f":"IF(ROWS($GJ$3:GJ26)>(ROWS($GJ$3:$GJ$33)-COUNTBLANK($GJ$3:$GJ$33)),\"\",INDEX($GJ$3:$GJ$33,SMALL(IF($GJ$3:$GJ$33<>\"\",ROW($GJ$3:$GJ$33)-2),ROWS($GJ$3:GJ26))))","v":{"$error":"#N/A"}},"Klamka AXA Prestige Flex","Inox",null,null,null,null,null,null,null,null,null,null,null,null,null,"Zestaw elektronik z zamkiem ryglowym","-",null,null,null,null,null,null,null,null,null,null,null,null,null,null,null,null,null,null,null,null,null,null,null,null,null,null,null,null,null,null,null,null,null,null,null,null,null,null,null,null,null,null,null,null,null,null,null,2400]
["DB 51",20,20,20,20,34,34,36,36,null,null,null,null,null,null,null,null,null,null,null,null,null,null,null,"RAL 1005",500,"RAL 1005",{"$f":"IF((VLOOKUP(Wycena!$C$7,Mapping!$Q$15:$R$20,2,0))=\"tak\",\"\",AA27)","v":"RAL 1005"},{"$f":"IF(ROWS($AB$3:AB27)>(ROWS($AB$3:$AB$229)-COUNTBLANK($AB$3:$AB$229)),\"\",INDEX($AB$3:$AB$229,SMALL(IF($AB$3:$AB$229<>\"\",ROW($AB$3:$AB$229)-2),ROWS($AB$3:AB27))))","v":{"$error":"#N/A"}},null,null,null,null,null,null,null,null,null,null,null,null,null,null,null,null,null,null,null,null,96,0,0,{"$f":"IF(Wycena!$C$16=78,Mapping!AY27,AZ27)","v":0},null,null,204,0,0,{"$f":"IF(Wycena!$C$16=78,Mapping!BE27,BF27)","v":0},null,null,null,null,null,null,null,null,null,null,null,null,null,null,null,null,null,null,null,null,null,null,null,null,null,null,null,null,null,null,null,null,null,{"$f":"VLOOKUP(Wycena!C26,$CO$28:$CS$37,IF(AND(Wycena!C20=\"-\",Wycena!C21=\"-\"),2,IF(AND(Wycena!C20<>\"-\",Wycena!C21=\"-\"),3,IF(AND(Wycena!C20=\"-\",Wycena!C21<>\"-\"),4,5))),0)","v":0},null,null,null,null,null,null,null,null,null,null,null,29,{"$f":"IF(DA27>=VLOOKUP(Wycena!$C$14,Mapping!$CY$3:$CZ$5,2,0),DA27,\"\")","v":29},{"$f":"IF(ROWS($DB$3:DB27)>(ROWS($DB$3:$DB$28)-COUNTBLANK($DB$3:$DB$28)),\"\",INDEX($DB$3:$DB$28,SMALL(IF($DB$3:$DB$28<>\"\",ROW($DB$3:$DB$28)-2),ROWS($DB$3:DB27))))","v":30},null,null,null,null,null,null,null,29,{"$f":"IF(DK27>=VLOOKUP(Wycena!$C$14,Mapping!$DG$3:$DH$5,2,0),DK27,\"\")","v":29},{"$f":"IF(ROWS($DL$3:DL27)>(ROWS($DL$3:$DL$28)-COUNTBLANK($DL$3:$DL$28)),\"\",INDEX($DL$3:$DL$28,SMALL(IF($DL$3:$DL$28<>\"\",ROW($DL$3:$DL$28)-2),ROWS($DL$3:DL27))))","v":30},{"$f":"IF(DK27>=VLOOKUP(Wycena!$C$14,Mapping!$DG$3:$DI$5,3,0),DK27,\"\")","v":29},{"$f":"IF(ROWS($DN$3:DN27)>(ROWS($DN$3:$DN$28)-COUNTBLANK($DN$3:$DN$28)),\"\",INDEX($DN$3:$DN$28,SMALL(IF($DN$3:$DN$28<>\"\",ROW($DN$3:$DN$28)-2),ROWS($DN$3:DN27))))","v":30},null,null,null,29,{"$f":"IF(DS27>=VLOOKUP(Wycena!$C$25,Mapping!$DQ$3:$DR$4,2,0),DS27,\"\")","v":29},{"$f":"IF(ROWS($DT$3:DT27)>(ROWS($DT$3:$DT$28)-COUNTBLANK($DT$3:$DT$28)),\"\",INDEX($DT$3:$DT$28,SMALL(IF($DT$3:$DT$28<>\"\",ROW($DT$3:$DT$28)-2),ROWS($DT$3:DT27))))","v":""},null,24,null,null,null,null,null,null,null,null,null,null,null,null,null,null,null,null,null,null,null,null,null,null,null,null,null,null,null,null,null,null,null,null,null,null,null,null,null,null,null,null,null,null,null,null,null,null,null,null,null,null,null,"Zestaw elektronik z zamkiem automatycznym","Automat 3-punktowy bez gałki","Zestaw czytnik linii papilarnych dLine",1,"Antaba Medos Paris okrągła skośna + klamka Warszawa",1000,{"$f":"IF(VLOOKUP(Wycena!$C$5,SKU!$B$1:$D$743,3,0)=\"Płycinowe\",GA27,\"\")","v":{"$error":"#N/A"}},{"$error":"#N/A"},{"$error":"#N/A"},{"$error":"#N/A"},null,null,{"$error":"#N/A"},{"$f":"IF((HLOOKUP(VLOOKUP(Wycena!$C$59,Mapping!$GI$35:$GJ$43,2,0),$GD$1:$GI$33,2+GK27))=0,\"\",(HLOOKUP(VLOOKUP(Wycena!$C$59,Mapping!$GI$35:$GJ$43,2,0),$GD$1:$GI$33,2+GK27)))","v":{"$error":"#N/A"}},25,{"$f":"IF(ROWS($GJ$3:GJ27)>(ROWS($GJ$3:$GJ$33)-COUNTBLANK($GJ$3:$GJ$33)),\"\",INDEX($GJ$3:$GJ$33,SMALL(IF($GJ$3:$GJ$33<>\"\",ROW($GJ$3:$GJ$33)-2),ROWS($GJ$3:GJ27))))","v":{"$error":"#N/A"}},"Klamka AXA Prestige Flex","Tytan",null,null,null,null,null,null,null,null,null,null,null,null,null,"Zestaw elektronik z zamkiem ryglowym","Tak",null,null,null,null,null,null,null,null,null,null,null,null,null,null,null,null,null,null,null,null,null,null,null,null,null,null,null,null,null,null,null,null,null,null,null,null,null,null,null,null,null,null,null,null,null,null,null,2500]
["DB 52a",20,20,20,20,34,34,36,36,null,null,null,null,null,null,null,null,null,null,null,null,null,null,null,"RAL 1006",500,"RAL 1006",{"$f":"IF((VLOOKUP(Wycena!$C$7,Mapping!$Q$15:$R$20,2,0))=\"tak\",\"\",AA28)","v":"RAL 1006"},{"$f":"IF(ROWS($AB$3:AB28)>(ROWS($AB$3:$AB$229)-COUNTBLANK($AB$3:$AB$229)),\"\",INDEX($AB$3:$AB$229,SMALL(IF($AB$3:$AB$229<>\"\",ROW($AB$3:$AB$229)-2),ROWS($AB$3:AB28))))","v":{"$error":"#N/A"}},null,null,null,null,null,null,null,null,null,null,null,null,null,null,null,null,null,null,null,null,97,0,0,{"$f":"IF(Wycena!$C$16=78,Mapping!AY28,AZ28)","v":0},null,null,205,0,0,{"$f":"IF(Wycena!$C$16=78,Mapping!BE28,BF28)","v":0},null,null,null,null,null,null,null,null,null,null,null,null,null,null,null,null,null,null,null,null,null,null,null,null,null,null,null,null,null,null,null,null,null,"Dla ościeżnicy od zamka","SOLO","DOSTAWKA OD ZAWIAS","DOSTAWKA OD ZAMKA","2 DOSTAWKI",null,null,null,null,null,null,null,30,{"$f":"IF(DA28>=VLOOKUP(Wycena!$C$14,Mapping!$CY$3:$CZ$5,2,0),DA28,\"\")","v":30},{"$f":"IF(ROWS($DB$3:DB28)>(ROWS($DB$3:$DB$28)-COUNTBLANK($DB$3:$DB$28)),\"\",INDEX($DB$3:$DB$28,SMALL(IF($DB$3:$DB$28<>\"\",ROW($DB$3:$DB$28)-2),ROWS($DB$3:DB28))))","v":""},null,null,null,null,null,null,null,30,{"$f":"IF(DK28>=VLOOKUP(Wycena!$C$14,Mapping!$DG$3:$DH$5,2,0),DK28,\"\")","v":30},{"$f":"IF(ROWS($DL$3:DL28)>(ROWS($DL$3:$DL$28)-COUNTBLANK($DL$3:$DL$28)),\"\",INDEX($DL$3:$DL$28,SMALL(IF($DL$3:$DL$28<>\"\",ROW($DL$3:$DL$28)-2),ROWS($DL$3:DL28))))","v":""},{"$f":"IF(DK28>=VLOOKUP(Wycena!$C$14,Mapping!$DG$3:$DI$5,3,0),DK28,\"\")","v":30},{"$f":"IF(ROWS($DN$3:DN28)>(ROWS($DN$3:$DN$28)-COUNTBLANK($DN$3:$DN$28)),\"\",INDEX($DN$3:$DN$28,SMALL(IF($DN$3:$DN$28<>\"\",ROW($DN$3:$DN$28)-2),ROWS($DN$3:DN28))))","v":""},null,null,null,30,{"$f":"IF(DS28>=VLOOKUP(Wycena!$C$25,Mapping!$DQ$3:$DR$4,2,0),DS28,\"\")","v":30},{"$f":"IF(ROWS($DT$3:DT28)>(ROWS($DT$3:$DT$28)-COUNTBLANK($DT$3:$DT$28)),\"\",INDEX($DT$3:$DT$28,SMALL(IF($DT$3:$DT$28<>\"\",ROW($DT$3:$DT$28)-2),ROWS($DT$3:DT28))))","v":""},null,25,null,null,null,null,null,null,null,null,null,null,null,null,null,null,null,null,null,null,null,null,null,null,null,null,null,null,null,null,null,null,null,null,null,null,null,null,null,null,null,null,null,null,null,null,null,null,null,null,null,null,null,"Zestaw elektronik z zamkiem automatycznym","Automat 4-punktowy","Zestaw UNILOCK",1,"Antaba Vegas prostokątna polerowana + klamka Warszawa",1700,{"$f":"IF(VLOOKUP(Wycena!$C$5,SKU!$B$1:$D$743,3,0)=\"Płytowe\",GA28,\"\")","v":{"$error":"#N/A"}},{"$error":"#N/A"},{"$f":"GD28","v":{"$error":"#N/A"}},{"$f":"GE28","v":{"$error":"#N/A"}},null,null,{"$error":"#N/A"},{"$f":"IF((HLOOKUP(VLOOKUP(Wycena!$C$59,Mapping!$GI$35:$GJ$43,2,0),$GD$1:$GI$33,2+GK28))=0,\"\",(HLOOKUP(VLOOKUP(Wycena!$C$59,Mapping!$GI$35:$GJ$43,2,0),$GD$1:$GI$33,2+GK28)))","v":{"$error":"#N/A"}},26,{"$f":"IF(ROWS($GJ$3:GJ28)>(ROWS($GJ$3:$GJ$33)-COUNTBLANK($GJ$3:$GJ$33)),\"\",INDEX($GJ$3:$GJ$33,SMALL(IF($GJ$3:$GJ$33<>\"\",ROW($GJ$3:$GJ$33)-2),ROWS($GJ$3:GJ28))))","v":""},"Klamka AXA Prestige Flex","Stare złoto",null,null,null,null,null,null,null,null,null,null,null,null,null,"Zestaw elektronik z zamkiem automatycznym","-",null,null,null,null,null,null,null,null,null,null,null,null,null,null,null,null,null,null,null,null,null,null,null,null,null,null,null,null,null,null,null,null,null,null,null,null,null,null,null,null,null,null,null,null,null,null,null,2600]
["DB 55",20,20,20,20,34,34,36,36,null,null,null,null,null,null,null,null,null,null,null,null,null,null,null,"RAL 1007",500,"RAL 1007",{"$f":"IF((VLOOKUP(Wycena!$C$7,Mapping!$Q$15:$R$20,2,0))=\"tak\",\"\",AA29)","v":"RAL 1007"},{"$f":"IF(ROWS($AB$3:AB29)>(ROWS($AB$3:$AB$229)-COUNTBLANK($AB$3:$AB$229)),\"\",INDEX($AB$3:$AB$229,SMALL(IF($AB$3:$AB$229<>\"\",ROW($AB$3:$AB$229)-2),ROWS($AB$3:AB29))))","v":{"$error":"#N/A"}},null,null,null,null,null,null,null,null,null,null,null,null,null,null,null,null,null,null,null,null,98,0,0,{"$f":"IF(Wycena!$C$16=78,Mapping!AY29,AZ29)","v":0},null,null,206,0,0,{"$f":"IF(Wycena!$C$16=78,Mapping!BE29,BF29)","v":0},null,null,null,null,null,null,null,null,null,null,null,null,null,null,null,null,null,null,null,null,null,null,null,null,null,null,null,null,null,null,null,null,null,"-",0,0,0,0,null,null,null,null,null,null,null,"x","x","x",null,null,null,null,null,null,null,"x","x","x","x","x",null,null,null,"x","x","x",null,26,null,null,null,null,null,null,null,null,null,null,null,null,null,null,null,null,null,null,null,null,null,null,null,null,null,null,null,null,null,null,null,null,null,null,null,null,null,null,null,null,null,null,null,null,null,null,null,null,null,null,null,"Zestaw z pochwytem na styl amerykański","Pojedynczy jedna wkładka","Zestaw UNILOCK WIFI",1,null,null,{"$f":"IF(VLOOKUP(Wycena!$C$5,SKU!$B$1:$D$743,3,0)=\"Płytowe\",GA29,\"\")","v":{"$error":"#N/A"}},{"$error":"#N/A"},null,null,null,null,{"$error":"#N/A"},{"$f":"IF((HLOOKUP(VLOOKUP(Wycena!$C$59,Mapping!$GI$35:$GJ$43,2,0),$GD$1:$GI$33,2+GK29))=0,\"\",(HLOOKUP(VLOOKUP(Wycena!$C$59,Mapping!$GI$35:$GJ$43,2,0),$GD$1:$GI$33,2+GK29)))","v":{"$error":"#N/A"}},27,{"$f":"IF(ROWS($GJ$3:GJ29)>(ROWS($GJ$3:$GJ$33)-COUNTBLANK($GJ$3:$GJ$33)),\"\",INDEX($GJ$3:$GJ$33,SMALL(IF($GJ$3:$GJ$33<>\"\",ROW($GJ$3:$GJ$33)-2),ROWS($GJ$3:GJ29))))","v":""},"Klamka AXA Slim Plus","Inox",null,null,null,null,null,null,null,null,null,null,null,null,null,"Zestaw elektronik z zamkiem automatycznym","Tak",null,null,null,null,null,null,null,null,null,null,null,null,null,null,null,null,null,null,null,null,null,null,null,null,null,null,null,null,null,null,null,null,null,null,null,null,null,null,null,null,null,null,null,null,null,null,null,2700]
["DB 56",20,20,20,20,34,34,36,36,null,null,null,null,null,null,null,null,null,null,null,null,null,null,null,"RAL 1011",500,"RAL 1011",{"$f":"IF((VLOOKUP(Wycena!$C$7,Mapping!$Q$15:$R$20,2,0))=\"tak\",\"\",AA30)","v":"RAL 1011"},{"$f":"IF(ROWS($AB$3:AB30)>(ROWS($AB$3:$AB$229)-COUNTBLANK($AB$3:$AB$229)),\"\",INDEX($AB$3:$AB$229,SMALL(IF($AB$3:$AB$229<>\"\",ROW($AB$3:$AB$229)-2),ROWS($AB$3:AB30))))","v":{"$error":"#N/A"}},null,null,null,null,null,null,null,null,null,null,null,null,null,null,null,null,null,null,null,null,99,0,0,{"$f":"IF(Wycena!$C$16=78,Mapping!AY30,AZ30)","v":0},null,null,207,0,0,{"$f":"IF(Wycena!$C$16=78,Mapping!BE30,BF30)","v":0},null,null,null,null,null,null,null,null,null,null,null,null,null,null,null,null,null,null,null,null,null,null,null,null,null,null,null,null,null,null,null,null,null,"Przy skrzydle od zewnątrz",{"$f":"IF(Wycena!$C$14=\"Przylgowe\",8,IF(Wycena!$C$14=\"Bezprzylgowe\",6,0))","v":8},{"$f":"IF(Wycena!$C$14=\"Przylgowe\",8,IF(Wycena!$C$14=\"Bezprzylgowe\",6,0))","v":8},0,0,null,null,null,null,null,null,null,null,null,null,null,null,null,null,null,null,null,null,null,null,null,null,null,null,null,null,null,null,null,27,null,null,null,null,null,null,null,null,null,null,null,null,null,null,null,null,null,null,null,null,null,null,null,null,null,null,null,null,null,null,null,null,null,null,null,null,null,null,null,null,null,null,null,null,null,null,null,null,null,null,null,"Zestaw z pochwytem na styl amerykański","Podwójny dwie wkładki","Zestaw elektronik z zamkiem automatycznym",null,null,null,{"$f":"IF(VLOOKUP(Wycena!$C$5,SKU!$B$1:$D$743,3,0)=\"Płytowe\",GA30,\"\")","v":{"$error":"#N/A"}},{"$error":"#N/A"},{"$f":"GC30","v":{"$error":"#N/A"}},{"$f":"GC30","v":{"$error":"#N/A"}},null,null,{"$error":"#N/A"},{"$f":"IF((HLOOKUP(VLOOKUP(Wycena!$C$59,Mapping!$GI$35:$GJ$43,2,0),$GD$1:$GI$33,2+GK30))=0,\"\",(HLOOKUP(VLOOKUP(Wycena!$C$59,Mapping!$GI$35:$GJ$43,2,0),$GD$1:$GI$33,2+GK30)))","v":{"$error":"#N/A"}},28,{"$f":"IF(ROWS($GJ$3:GJ30)>(ROWS($GJ$3:$GJ$33)-COUNTBLANK($GJ$3:$GJ$33)),\"\",INDEX($GJ$3:$GJ$33,SMALL(IF($GJ$3:$GJ$33<>\"\",ROW($GJ$3:$GJ$33)-2),ROWS($GJ$3:GJ30))))","v":""},"Klamka AXA Slim Plus","Tytan",null,null,null,null,null,null,null,null,null,null,null,null,null,"Zestaw z pochwytem na styl amerykański","-",null,null,null,null,null,null,null,null,null,null,null,null,null,null,null,null,null,null,null,null,null,null,null,null,null,null,null,null,null,null,null,null,null,null,null,null,null,null,null,null,null,null,null,null,null,null,null,2800]
["DB 56a",20,20,20,20,34,34,36,36,null,null,null,null,null,null,null,null,null,null,null,null,null,null,null,"RAL 1012",500,"RAL 1012",{"$f":"IF((VLOOKUP(Wycena!$C$7,Mapping!$Q$15:$R$20,2,0))=\"tak\",\"\",AA31)","v":"RAL 1012"},{"$f":"IF(ROWS($AB$3:AB31)>(ROWS($AB$3:$AB$229)-COUNTBLANK($AB$3:$AB$229)),\"\",INDEX($AB$3:$AB$229,SMALL(IF($AB$3:$AB$229<>\"\",ROW($AB$3:$AB$229)-2),ROWS($AB$3:AB31))))","v":{"$error":"#N/A"}},null,null,null,null,null,null,null,null,null,null,null,null,null,null,null,null,null,null,null,null,100,0,0,{"$f":"IF(Wycena!$C$16=78,Mapping!AY31,AZ31)","v":0},null,null,208,0,0,{"$f":"IF(Wycena!$C$16=78,Mapping!BE31,BF31)","v":0},null,null,null,null,null,null,null,null,null,null,null,null,null,null,null,null,null,null,null,null,null,null,null,null,null,null,null,null,null,null,null,null,null,"Przy skrzydle z dwóch stron",{"$f":"IF(Wycena!$C$14=\"Przylgowe\",8,IF(Wycena!$C$14=\"Bezprzylgowe\",6,0))","v":8},{"$f":"IF(Wycena!$C$14=\"Przylgowe\",8,IF(Wycena!$C$14=\"Bezprzylgowe\",6,0))","v":8},0,0,null,null,null,null,null,null,null,null,null,{"$f":"$DC$3:INDEX($DC$3:$DC$28,(ROWS($DB$3:$DB$28)-COUNTBLANK($DB$3:$DB$28)))","v":6},null,null,null,null,null,null,null,null,null,{"$f":"$DM$3:INDEX($DM$3:$DM$28,(ROWS($DL$3:$DL$28)-COUNTBLANK($DL$3:$DL$28)))","v":6},null,{"$f":"$DO$3:INDEX($DO$3:$DO$28,(ROWS($DN$3:$DN$28)-COUNTBLANK($DN$3:$DN$28)))","v":6},null,null,null,null,null,{"$f":"$DU$3:INDEX($DU$3:$DU$28,(ROWS($DT$3:$DT$28)-COUNTBLANK($DT$3:$DT$28)))","v":10.5},null,28,null,null,null,null,null,null,null,null,null,null,null,null,null,null,null,null,null,null,null,null,null,null,null,null,null,null,null,null,null,null,null,null,null,null,null,null,null,null,null,null,null,null,null,null,null,null,null,null,null,null,null,"Zestaw antywłamaniowy RC2","Automat 4-punktowy","Zestaw antywłamaniowy RC2",null,null,null,{"$f":"IF(VLOOKUP(Wycena!$C$5,SKU!$B$1:$D$743,3,0)=\"Płycinowe\",GA31,\"\")","v":{"$error":"#N/A"}},{"$error":"#N/A"},{"$f":"GC31","v":{"$error":"#N/A"}},{"$f":"GC31","v":{"$error":"#N/A"}},null,null,{"$error":"#N/A"},{"$f":"IF((HLOOKUP(VLOOKUP(Wycena!$C$59,Mapping!$GI$35:$GJ$43,2,0),$GD$1:$GI$33,2+GK31))=0,\"\",(HLOOKUP(VLOOKUP(Wycena!$C$59,Mapping!$GI$35:$GJ$43,2,0),$GD$1:$GI$33,2+GK31)))","v":{"$error":"#N/A"}},29,{"$f":"IF(ROWS($GJ$3:GJ31)>(ROWS($GJ$3:$GJ$33)-COUNTBLANK($GJ$3:$GJ$33)),\"\",INDEX($GJ$3:$GJ$33,SMALL(IF($GJ$3:$GJ$33<>\"\",ROW($GJ$3:$GJ$33)-2),ROWS($GJ$3:GJ31))))","v":""},"Klamka AXA Slim Plus","Stare złoto",null,null,null,null,null,null,null,null,null,null,null,null,null,"Zestaw antywłamaniowy RC2","Tak",null,null,null,null,null,null,null,null,null,null,null,null,null,null,null,null,null,null,null,null,null,null,null,null,null,null,null,null,null,null,null,null,null,null,null,null,null,null,null,null,null,null,null,null,null,null,null,2900]
["DB 57",20,20,20,20,34,34,36,36,null,null,null,null,null,null,null,null,null,null,null,null,null,null,null,"RAL 1013",500,"RAL 1013",{"$f":"IF((VLOOKUP(Wycena!$C$7,Mapping!$Q$15:$R$20,2,0))=\"tak\",\"\",AA32)","v":"RAL 1013"},{"$f":"IF(ROWS($AB$3:AB32)>(ROWS($AB$3:$AB$229)-COUNTBLANK($AB$3:$AB$229)),\"\",INDEX($AB$3:$AB$229,SMALL(IF($AB$3:$AB$229<>\"\",ROW($AB$3:$AB$229)-2),ROWS($AB$3:AB32))))","v":{"$error":"#N/A"}},null,null,null,null,null,null,null,null,null,null,null,null,null,null,null,null,null,null,null,null,101,0,0,{"$f":"IF(Wycena!$C$16=78,Mapping!AY32,AZ32)","v":0},null,null,209,0,0,{"$f":"IF(Wycena!$C$16=78,Mapping!BE32,BF32)","v":0},null,null,null,null,null,null,null,null,null,null,null,null,null,null,null,null,null,null,null,null,null,null,null,null,null,null,null,null,null,null,null,null,null,"Przy skrzydle i ościeżnicy od zewnątrz",null,{"$f":"IF(Wycena!$C$14=\"Przylgowe\",8,IF(Wycena!$C$14=\"Bezprzylgowe\",6,0))","v":8},{"$f":"IF(Wycena!$C$14=\"Przylgowe\",8,IF(Wycena!$C$14=\"Bezprzylgowe\",6,0))","v":8},{"$f":"IF(Wycena!$C$14=\"Przylgowe\",8,IF(Wycena!$C$14=\"Bezprzylgowe\",6,0))","v":8},null,null,null,null,null,null,null,null,null,null,null,null,null,null,null,null,null,null,null,null,null,null,null,null,null,null,null,null,null,29,null,null,null,null,null,null,null,null,null,null,null,null,null,null,null,null,null,null,null,null,null,null,null,null,null,null,null,null,null,null,null,null,null,null,null,null,null,null,null,null,null,null,null,null,null,null,null,null,null,null,null,"Zestaw czytnik linii papilarnych","Automat ADR 5-punktowy bez gałki",null,null,null,null,{"$f":"IF(VLOOKUP(Wycena!$C$5,SKU!$B$1:$D$743,3,0)=\"Płytowe\",GA32,\"\")","v":{"$error":"#N/A"}},{"$error":"#N/A"},{"$f":"GC32","v":{"$error":"#N/A"}},{"$f":"GC32","v":{"$error":"#N/A"}},null,null,{"$error":"#N/A"},{"$f":"IF((HLOOKUP(VLOOKUP(Wycena!$C$59,Mapping!$GI$35:$GJ$43,2,0),$GD$1:$GI$33,2+GK32))=0,\"\",(HLOOKUP(VLOOKUP(Wycena!$C$59,Mapping!$GI$35:$GJ$43,2,0),$GD$1:$GI$33,2+GK32)))","v":{"$error":"#N/A"}},30,{"$f":"IF(ROWS($GJ$3:GJ32)>(ROWS($GJ$3:$GJ$33)-COUNTBLANK($GJ$3:$GJ$33)),\"\",INDEX($GJ$3:$GJ$33,SMALL(IF($GJ$3:$GJ$33<>\"\",ROW($GJ$3:$GJ$33)-2),ROWS($GJ$3:GJ32))))","v":""},"Klamko - gałka Medos Warszawa","Inox",null,null,null,null,null,null,null,null,null,null,null,null,null,"Zestaw czytnik linii papilarnych","-",null,null,null,null,null,null,null,null,null,null,null,null,null,null,null,null,null,null,null,null,null,null,null,null,null,null,null,null,null,null,null,null,null,null,null,null,null,null,null,null,null,null,null,null,null,null,null,3000]
["DB 59",20,20,20,20,34,34,36,36,null,null,null,null,null,null,null,null,null,null,null,null,null,null,null,"RAL 1014",500,"RAL 1014",{"$f":"IF((VLOOKUP(Wycena!$C$7,Mapping!$Q$15:$R$20,2,0))=\"tak\",\"\",AA33)","v":"RAL 1014"},{"$f":"IF(ROWS($AB$3:AB33)>(ROWS($AB$3:$AB$229)-COUNTBLANK($AB$3:$AB$229)),\"\",INDEX($AB$3:$AB$229,SMALL(IF($AB$3:$AB$229<>\"\",ROW($AB$3:$AB$229)-2),ROWS($AB$3:AB33))))","v":{"$error":"#N/A"}},null,null,null,null,null,null,null,null,null,null,null,null,null,null,null,null,null,null,null,null,102,0,0,{"$f":"IF(Wycena!$C$16=78,Mapping!AY33,AZ33)","v":0},null,null,210,0,0,{"$f":"IF(Wycena!$C$16=78,Mapping!BE33,BF33)","v":0},null,null,null,null,null,null,null,null,null,null,null,null,null,null,null,null,null,null,null,null,null,null,null,null,null,null,null,null,null,null,null,null,null,"Przy skrzydle i ościeżnicy z dwóch stron",null,{"$f":"IF(Wycena!$C$14=\"Przylgowe\",8,IF(Wycena!$C$14=\"Bezprzylgowe\",6,0))","v":8},{"$f":"IF(Wycena!$C$14=\"Przylgowe\",8,IF(Wycena!$C$14=\"Bezprzylgowe\",6,0))","v":8},{"$f":"IF(Wycena!$C$14=\"Przylgowe\",8,IF(Wycena!$C$14=\"Bezprzylgowe\",6,0))","v":8},null,null,null,null,null,null,null,null,null,null,null,null,null,null,null,null,null,null,null,null,null,null,null,null,null,null,null,null,null,30,null,null,null,null,null,null,null,null,null,null,null,null,null,null,null,null,null,null,null,null,null,null,null,null,null,null,null,null,null,null,null,null,null,null,null,null,null,null,null,null,null,null,null,null,null,null,null,null,null,null,null,"Zestaw czytnik linii papilarnych","Automat ADR 5-punktowy z gałką",null,null,null,null,{"$f":"IF(VLOOKUP(Wycena!$C$5,SKU!$B$1:$D$743,3,0)=\"Płycinowe\",GA33,\"\")","v":{"$error":"#N/A"}},{"$error":"#N/A"},{"$f":"GC33","v":{"$error":"#N/A"}},{"$f":"GC33","v":{"$error":"#N/A"}},null,null,{"$error":"#N/A"},null,31,{"$f":"IF(ROWS($GJ$3:GJ33)>(ROWS($GJ$3:$GJ$33)-COUNTBLANK($GJ$3:$GJ$33)),\"\",INDEX($GJ$3:$GJ$33,SMALL(IF($GJ$3:$GJ$33<>\"\",ROW($GJ$3:$GJ$33)-2),ROWS($GJ$3:GJ33))))","v":""},"Klamko - gałka Medos Warszawa","Stare złoto",null,null,null,null,null,null,null,null,null,null,null,null,null,"Zestaw czytnik linii papilarnych","Tak",null,null,null,null,null,null,null,null,null,null,null,null,null,null,null,null,null,null,null,null,null,null,null,null,null,null,null,null,null,null,null,null,null,null,null,null,null,null,null,null,null,null,null,null,null,null,null,3100]
["DB 59a",20,20,20,20,34,34,36,36,null,null,null,null,null,null,null,null,null,null,null,null,null,null,null,"RAL 1015",500,"RAL 1015",{"$f":"IF((VLOOKUP(Wycena!$C$7,Mapping!$Q$15:$R$20,2,0))=\"tak\",\"\",AA34)","v":"RAL 1015"},{"$f":"IF(ROWS($AB$3:AB34)>(ROWS($AB$3:$AB$229)-COUNTBLANK($AB$3:$AB$229)),\"\",INDEX($AB$3:$AB$229,SMALL(IF($AB$3:$AB$229<>\"\",ROW($AB$3:$AB$229)-2),ROWS($AB$3:AB34))))","v":{"$error":"#N/A"}},null,null,null,null,null,null,null,null,null,null,null,null,null,null,null,null,null,null,null,null,103,0,0,{"$f":"IF(Wycena!$C$16=78,Mapping!AY34,AZ34)","v":0},null,null,211,0,0,{"$f":"IF(Wycena!$C$16=78,Mapping!BE34,BF34)","v":0},null,null,null,null,null,null,null,null,null,null,null,null,null,null,null,null,null,null,null,null,null,null,null,null,null,null,null,null,null,null,null,null,null,"Przy skrzydle i naświetlu od zewnątrz",null,{"$f":"IF(Wycena!$C$14=\"Przylgowe\",8,IF(Wycena!$C$14=\"Bezprzylgowe\",6,0))","v":8},0,0,null,null,null,null,null,null,null,null,null,null,null,null,null,null,null,null,null,null,null,null,null,null,null,null,null,null,null,null,null,null,null,null,null,null,null,null,null,null,null,null,null,null,null,null,null,null,null,null,null,null,null,null,null,null,null,null,null,null,null,null,null,null,null,null,null,null,null,null,null,null,null,null,null,null,null,null,null,null,null,null,null,"Zestaw czytnik linii papilarnych dLine","Automat ADR 5-punktowy z gałką",null,null,null,null,null,null,null,null,null,null,"x","x","x","x","Klamko - gałka Medos Warszawa","Czarny",null,null,null,null,null,null,null,null,null,null,null,null,null,"Zestaw czytnik linii papilarnych dLine","-",null,null,null,null,null,null,null,null,null,null,null,null,null,null,null,null,null,null,null,null,null,null,null,null,null,null,null,null,null,null,null,null,null,null,null,null,null,null,null,null,null,null,null,null,null,null,null,3200]
["DB 60",20,20,20,20,34,34,36,36,null,null,null,null,null,null,null,null,null,null,null,null,null,null,null,"RAL 1016",500,"RAL 1016",{"$f":"IF((VLOOKUP(Wycena!$C$7,Mapping!$Q$15:$R$20,2,0))=\"tak\",\"\",AA35)","v":"RAL 1016"},{"$f":"IF(ROWS($AB$3:AB35)>(ROWS($AB$3:$AB$229)-COUNTBLANK($AB$3:$AB$229)),\"\",INDEX($AB$3:$AB$229,SMALL(IF($AB$3:$AB$229<>\"\",ROW($AB$3:$AB$229)-2),ROWS($AB$3:AB35))))","v":{"$error":"#N/A"}},null,null,null,null,null,null,null,null,null,null,null,null,null,null,null,null,null,null,null,null,104,0,0,{"$f":"IF(Wycena!$C$16=78,Mapping!AY35,AZ35)","v":0},null,null,212,0,0,{"$f":"IF(Wycena!$C$16=78,Mapping!BE35,BF35)","v":0},null,null,null,null,null,null,null,null,null,null,null,null,null,null,null,null,null,null,null,null,null,null,null,null,null,null,null,null,null,null,null,null,null,"Przy skrzydle i naświetlu z dwóch stron",{"$f":"IF(Wycena!$C$14=\"Przylgowe\",8,IF(Wycena!$C$14=\"Bezprzylgowe\",6,0))","v":8},{"$f":"IF(Wycena!$C$14=\"Przylgowe\",8,IF(Wycena!$C$14=\"Bezprzylgowe\",6,0))","v":8},0,0,null,null,null,null,null,null,null,null,null,null,null,null,null,null,null,null,null,null,null,null,null,null,null,null,null,null,null,null,null,null,null,null,null,null,null,null,null,null,null,null,null,null,null,null,null,null,null,null,null,null,null,null,null,null,null,null,null,null,null,null,null,null,null,null,null,null,null,null,null,null,null,null,null,null,null,null,null,null,null,null,null,"Zestaw czytnik linii papilarnych dLine","Automat ADR 5-punktowy bez gałki",null,null,null,null,null,null,null,null,null,null,"Brak (standard)",1,null,null,"Klamko - gałka Dublin Warszawa","Inox",null,null,null,null,null,null,null,null,null,null,null,null,null,"Zestaw czytnik linii papilarnych dLine","Tak",null,null,null,null,null,null,null,null,null,null,null,null,null,null,null,null,null,null,null,null,null,null,null,null,null,null,null,null,null,null,null,null,null,null,null,null,null,null,null,null,null,null,null,null,null,null,null,3300]
["DB 61a",20,20,20,20,34,34,36,36,null,null,null,null,null,null,null,null,null,null,null,null,null,null,null,"RAL 1017",500,"RAL 1017",{"$f":"IF((VLOOKUP(Wycena!$C$7,Mapping!$Q$15:$R$20,2,0))=\"tak\",\"\",AA36)","v":"RAL 1017"},{"$f":"IF(ROWS($AB$3:AB36)>(ROWS($AB$3:$AB$229)-COUNTBLANK($AB$3:$AB$229)),\"\",INDEX($AB$3:$AB$229,SMALL(IF($AB$3:$AB$229<>\"\",ROW($AB$3:$AB$229)-2),ROWS($AB$3:AB36))))","v":{"$error":"#N/A"}},null,null,null,null,null,null,null,null,null,null,null,null,null,null,null,null,null,null,null,null,105,0,0,{"$f":"IF(Wycena!$C$16=78,Mapping!AY36,AZ36)","v":0},null,null,213,0,0,{"$f":"IF(Wycena!$C$16=78,Mapping!BE36,BF36)","v":0},null,null,null,null,null,null,null,null,null,null,null,null,null,null,null,null,null,null,null,null,null,null,null,null,null,null,null,null,null,null,null,null,null,"Przy skrzydle, naświetlu i ościeżnicy od zewnątrz",{"$f":"IF(Wycena!$C$14=\"Przylgowe\",8,IF(Wycena!$C$14=\"Bezprzylgowe\",6,0))","v":8},{"$f":"IF(Wycena!$C$14=\"Przylgowe\",8,IF(Wycena!$C$14=\"Bezprzylgowe\",6,0))","v":8},{"$f":"IF(Wycena!$C$14=\"Przylgowe\",8,IF(Wycena!$C$14=\"Bezprzylgowe\",6,0))","v":8},{"$f":"IF(Wycena!$C$14=\"Przylgowe\",8,IF(Wycena!$C$14=\"Bezprzylgowe\",6,0))","v":8},null,null,null,null,null,null,null,null,null,null,null,null,null,null,null,null,null,null,null,null,null,null,null,null,null,null,null,null,null,null,null,null,null,null,null,null,null,null,null,null,null,null,null,null,null,null,null,null,null,null,null,null,null,null,null,null,null,null,null,null,null,null,null,null,null,null,null,null,null,null,null,null,null,null,null,null,null,null,null,null,null,"Zestaw UNILOCK","Automat ADR 5-punktowy z gałką",null,null,null,null,null,null,null,null,null,null,"Zestaw elektronik z zamkiem ryglowym",2,null,{"$f":"$GL$3:INDEX($GL$3:$GL$33,(ROWS($GJ$3:$GJ$33)-COUNTBLANK($GJ$3:$GJ$33)))","v":{"$error":"#N/A"}},"Klamko - gałka Dublin Warszawa","Stare złoto",null,null,null,null,null,null,null,null,null,null,null,null,null,"Zestaw UNILOCK","-",null,null,null,null,null,null,null,null,null,null,null,null,null,null,null,null,null,null,null,null,null,null,null,null,null,null,null,null,null,null,null,null,null,null,null,null,null,null,null,null,null,null,null,null,null,null,null,3400]
["DB 62a",20,20,20,20,34,34,36,36,null,null,null,null,null,null,null,null,null,null,null,null,null,null,null,"RAL 1018",500,"RAL 1018",{"$f":"IF((VLOOKUP(Wycena!$C$7,Mapping!$Q$15:$R$20,2,0))=\"tak\",\"\",AA37)","v":"RAL 1018"},{"$f":"IF(ROWS($AB$3:AB37)>(ROWS($AB$3:$AB$229)-COUNTBLANK($AB$3:$AB$229)),\"\",INDEX($AB$3:$AB$229,SMALL(IF($AB$3:$AB$229<>\"\",ROW($AB$3:$AB$229)-2),ROWS($AB$3:AB37))))","v":{"$error":"#N/A"}},null,null,null,null,null,null,null,null,null,null,null,null,null,null,null,null,null,null,null,null,106,0,0,{"$f":"IF(Wycena!$C$16=78,Mapping!AY37,AZ37)","v":0},null,null,214,0,0,{"$f":"IF(Wycena!$C$16=78,Mapping!BE37,BF37)","v":0},null,null,null,null,null,null,null,null,null,null,null,null,null,null,null,null,null,null,null,null,null,null,null,null,null,null,null,null,null,null,null,null,null,"Przy skrzydle, naświetlu i ościeżnicy z dwóch stron",null,{"$f":"IF(Wycena!$C$14=\"Przylgowe\",8,IF(Wycena!$C$14=\"Bezprzylgowe\",6,0))","v":8},{"$f":"IF(Wycena!$C$14=\"Przylgowe\",8,IF(Wycena!$C$14=\"Bezprzylgowe\",6,0))","v":8},{"$f":"IF(Wycena!$C$14=\"Przylgowe\",8,IF(Wycena!$C$14=\"Bezprzylgowe\",6,0))","v":8},null,null,null,null,null,null,null,null,null,null,null,null,null,null,null,null,null,null,null,null,null,null,null,null,null,null,null,null,null,null,null,null,null,null,null,null,null,null,null,null,null,null,null,null,null,null,null,null,null,null,null,null,null,null,null,null,null,null,null,null,null,null,null,null,null,null,null,null,null,null,null,null,null,null,null,null,null,null,null,null,null,"Zestaw UNILOCK","Automat ADR 5-punktowy bez gałki",null,null,null,null,null,null,null,null,null,null,"Zestaw elektronik z zamkiem automatycznym",3,null,null,"Klamko - gałka Dublin Warszawa","Czarny",null,null,null,null,null,null,null,null,null,null,null,null,null,"Zestaw UNILOCK","Tak",null,null,null,null,null,null,null,null,null,null,null,null,null,null,null,null,null,null,null,null,null,null,null,null,null,null,null,null,null,null,null,null,null,null,null,null,null,null,null,null,null,null,null,null,null,null,null,3500]
["DB 63",20,20,20,20,34,34,36,36,null,null,null,null,null,null,null,null,null,null,null,null,null,null,null,"RAL 1019",500,"RAL 1019",{"$f":"IF((VLOOKUP(Wycena!$C$7,Mapping!$Q$15:$R$20,2,0))=\"tak\",\"\",AA38)","v":"RAL 1019"},{"$f":"IF(ROWS($AB$3:AB38)>(ROWS($AB$3:$AB$229)-COUNTBLANK($AB$3:$AB$229)),\"\",INDEX($AB$3:$AB$229,SMALL(IF($AB$3:$AB$229<>\"\",ROW($AB$3:$AB$229)-2),ROWS($AB$3:AB38))))","v":{"$error":"#N/A"}},null,null,null,null,null,null,null,null,null,null,null,null,null,null,null,null,null,null,null,null,107,0,0,{"$f":"IF(Wycena!$C$16=78,Mapping!AY38,AZ38)","v":0},null,null,215,0,0,{"$f":"IF(Wycena!$C$16=78,Mapping!BE38,BF38)","v":0},null,null,null,null,null,null,null,null,null,null,null,null,null,null,null,null,null,null,null,null,null,null,null,null,null,null,null,null,null,null,null,null,null,null,null,null,null,null,null,null,null,null,null,null,null,null,null,null,null,null,null,null,null,null,null,null,null,null,null,null,null,null,null,null,null,null,null,null,null,null,null,null,null,null,null,null,null,null,null,null,null,null,null,null,null,null,null,null,null,null,null,null,null,null,null,null,null,null,null,null,null,null,null,null,null,null,null,null,null,null,null,null,null,null,null,null,null,null,null,"Zestaw UNILOCK WIFI","Automat ADR 5-punktowy z gałką",null,null,null,null,null,null,null,null,null,null,"Zestaw z pochwytem na styl amerykański",4,null,null,"Klamko - gałka Hoppe Bezpieczna","Satyna",null,null,null,null,null,null,null,null,null,null,null,null,null,"Zestaw UNILOCK WIFI","-",null,null,null,null,null,null,null,null,null,null,null,null,null,null,null,null,null,null,null,null,null,null,null,null,null,null,null,null,null,null,null,null,null,null,null,null,null,null,null,null,null,null,null,null,null,null,null,3600]
["DB 63a",20,20,20,20,34,34,36,36,null,null,null,null,null,null,null,null,null,null,null,null,null,null,null,"RAL 1020",500,"RAL 1020",{"$f":"IF((VLOOKUP(Wycena!$C$7,Mapping!$Q$15:$R$20,2,0))=\"tak\",\"\",AA39)","v":"RAL 1020"},{"$f":"IF(ROWS($AB$3:AB39)>(ROWS($AB$3:$AB$229)-COUNTBLANK($AB$3:$AB$229)),\"\",INDEX($AB$3:$AB$229,SMALL(IF($AB$3:$AB$229<>\"\",ROW($AB$3:$AB$229)-2),ROWS($AB$3:AB39))))","v":{"$error":"#N/A"}},null,null,null,null,null,null,null,null,null,null,null,null,null,null,null,null,null,null,null,null,108,0,0,{"$f":"IF(Wycena!$C$16=78,Mapping!AY39,AZ39)","v":0},null,null,216,0,0,{"$f":"IF(Wycena!$C$16=78,Mapping!BE39,BF39)","v":0},null,null,null,null,null,null,null,null,null,null,null,null,null,null,null,null,null,null,null,null,null,null,null,null,null,null,null,null,null,null,null,null,null,{"$f":"VLOOKUP(Wycena!C26,Mapping!$CO$40:$CS$49,IF(AND(Wycena!C20=\"-\",Wycena!C21=\"-\"),2,IF(AND(Wycena!C20<>\"-\",Wycena!C21=\"-\"),3,IF(AND(Wycena!C20=\"-\",Wycena!C21<>\"-\"),4,5))),0)","v":0},null,null,null,null,null,null,null,null,null,null,null,null,null,null,null,null,null,null,null,null,null,null,null,null,null,null,null,null,null,null,null,null,null,null,null,null,null,null,null,null,null,null,null,null,null,null,null,null,null,null,null,null,null,null,null,null,null,null,null,null,null,null,null,null,null,null,null,null,null,null,null,null,null,null,null,null,null,null,null,null,null,null,null,null,null,"Zestaw UNILOCK WIFI","Automat ADR 5-punktowy bez gałki",null,null,null,null,null,null,null,null,null,null,"Zestaw antywłamaniowy RC2",5,null,null,"Klamko - gałka Hoppe Bezpieczna","Patyna",null,null,null,null,null,null,null,null,null,null,null,null,null,"Zestaw UNILOCK WIFI","Tak",null,null,null,null,null,null,null,null,null,null,null,null,null,null,null,null,null,null,null,null,null,null,null,null,null,null,null,null,null,null,null,null,null,null,null,null,null,null,null,null,null,null,null,null,null,null,null,3700]
["DB 65",20,20,20,20,34,34,36,36,null,null,null,null,null,null,null,null,null,null,null,null,null,null,null,"RAL 1021",500,"RAL 1021",{"$f":"IF((VLOOKUP(Wycena!$C$7,Mapping!$Q$15:$R$20,2,0))=\"tak\",\"\",AA40)","v":"RAL 1021"},{"$f":"IF(ROWS($AB$3:AB40)>(ROWS($AB$3:$AB$229)-COUNTBLANK($AB$3:$AB$229)),\"\",INDEX($AB$3:$AB$229,SMALL(IF($AB$3:$AB$229<>\"\",ROW($AB$3:$AB$229)-2),ROWS($AB$3:AB40))))","v":{"$error":"#N/A"}},null,null,null,null,null,null,null,null,null,null,null,null,null,null,null,null,null,null,null,null,109,0,0,{"$f":"IF(Wycena!$C$16=78,Mapping!AY40,AZ40)","v":0},null,null,217,0,0,{"$f":"IF(Wycena!$C$16=78,Mapping!BE40,BF40)","v":0},null,null,null,null,null,null,null,null,null,null,null,null,null,null,null,null,null,null,null,null,null,null,null,null,null,null,null,null,null,null,null,null,null,"Dla dostawki od zawias","SOLO","DOSTAWKA OD ZAWIAS","DOSTAWKA OD ZAMKA","2 DOSTAWKI",null,null,null,null,null,null,null,null,null,null,null,null,null,null,null,null,null,null,null,null,null,null,null,null,null,null,null,null,null,null,null,null,null,null,null,null,null,null,null,null,null,null,null,null,null,null,null,null,null,null,null,null,null,null,null,null,null,null,null,null,null,null,null,null,null,null,null,null,null,null,null,null,null,null,null,null,null,null,null,null,null,null,null,null,null,null,null,null,null,null,null,null,null,"Zestaw czytnik linii papilarnych",6,null,null,"Klamko - gałka AXA Diva Flex","Inox",null,null,null,null,null,null,null,null,null,null,null,null,null,null,null,null,null,null,null,null,null,null,null,null,null,null,null,null,null,null,null,null,null,null,null,null,null,null,null,null,null,null,null,null,null,null,null,null,null,null,null,null,null,null,null,null,null,null,null,null,null,null,3800]
["DB 66a",20,20,20,20,34,34,36,36,null,null,null,null,null,null,null,null,null,null,null,null,null,null,null,"RAL 1023",500,"RAL 1023",{"$f":"IF((VLOOKUP(Wycena!$C$7,Mapping!$Q$15:$R$20,2,0))=\"tak\",\"\",AA41)","v":"RAL 1023"},{"$f":"IF(ROWS($AB$3:AB41)>(ROWS($AB$3:$AB$229)-COUNTBLANK($AB$3:$AB$229)),\"\",INDEX($AB$3:$AB$229,SMALL(IF($AB$3:$AB$229<>\"\",ROW($AB$3:$AB$229)-2),ROWS($AB$3:AB41))))","v":{"$error":"#N/A"}},null,null,null,null,null,null,null,null,null,null,null,null,null,null,null,null,null,null,null,null,110,0,0,{"$f":"IF(Wycena!$C$16=78,Mapping!AY41,AZ41)","v":0},null,null,218,0,0,{"$f":"IF(Wycena!$C$16=78,Mapping!BE41,BF41)","v":0},null,null,null,null,null,null,null,null,null,null,null,null,null,null,null,null,null,null,null,null,null,null,null,null,null,null,null,null,null,null,null,null,null,"-",0,0,0,0,null,null,null,null,null,null,null,null,null,null,null,null,null,null,null,null,null,null,null,null,null,null,null,null,null,null,null,null,null,null,null,null,null,null,null,null,null,null,null,null,null,null,null,null,null,null,null,null,null,null,null,null,null,null,null,null,null,null,null,null,null,null,null,null,null,null,null,null,null,null,null,null,null,null,null,null,null,null,null,null,null,null,null,null,null,null,null,null,null,null,null,null,null,"Zestaw czytnik linii papilarnych dLine",6,null,null,"Klamko - gałka AXA Diva Flex","Tytan",null,null,null,null,null,null,null,null,null,null,null,null,null,null,null,null,null,null,null,null,null,null,null,null,null,null,null,null,null,null,null,null,null,null,null,null,null,null,null,null,null,null,null,null,null,null,null,null,null,null,null,null,null,null,null,null,null,null,null,null,null,null,3900]
["DB 67",20,20,20,20,34,34,36,36,null,null,null,null,null,null,null,null,null,null,null,null,null,null,null,"RAL 1024",500,"RAL 1024",{"$f":"IF((VLOOKUP(Wycena!$C$7,Mapping!$Q$15:$R$20,2,0))=\"tak\",\"\",AA42)","v":"RAL 1024"},{"$f":"IF(ROWS($AB$3:AB42)>(ROWS($AB$3:$AB$229)-COUNTBLANK($AB$3:$AB$229)),\"\",INDEX($AB$3:$AB$229,SMALL(IF($AB$3:$AB$229<>\"\",ROW($AB$3:$AB$229)-2),ROWS($AB$3:AB42))))","v":{"$error":"#N/A"}},null,null,null,null,null,null,null,null,null,null,null,null,null,null,null,null,null,null,null,null,111,0,0,{"$f":"IF(Wycena!$C$16=78,Mapping!AY42,AZ42)","v":0},null,null,219,0,0,{"$f":"IF(Wycena!$C$16=78,Mapping!BE42,BF42)","v":0},null,null,null,null,null,null,null,null,null,null,null,null,null,null,null,null,null,null,null,null,null,null,null,null,null,null,null,null,null,null,null,null,null,"Przy skrzydle od zewnątrz",null,{"$f":"-IF(Wycena!$C$14=\"Przylgowe\",8,IF(Wycena!$C$14=\"Bezprzylgowe\",6,0))","v":-8},0,{"$f":"-IF(Wycena!$C$14=\"Przylgowe\",8,IF(Wycena!$C$14=\"Bezprzylgowe\",6,0))","v":-8},null,null,null,null,null,null,null,null,null,null,null,null,null,null,null,null,null,null,null,null,null,null,null,null,null,null,null,null,null,null,null,null,null,null,null,null,null,null,null,null,null,null,null,null,null,null,null,null,null,null,null,null,null,null,null,null,null,null,null,null,null,null,null,null,null,null,null,null,null,null,null,null,null,null,null,null,null,null,null,null,null,null,null,null,null,null,null,null,null,null,null,null,null,"Zestaw UNILOCK",6,null,null,null,null,null,null,null,null,null,null,null,null,null,null,null,null,null,null,null,null,null,null,null,null,null,null,null,null,null,null,null,null,null,null,null,null,null,null,null,null,null,null,null,null,null,null,null,null,null,null,null,null,null,null,null,null,null,null,null,null,null,null,null,null,null,null,4000]
["DB 68a",20,20,20,20,34,34,36,36,null,null,null,null,null,null,null,null,null,null,null,null,null,null,null,"RAL 1026",500,{"$f":"Y43","v":"RAL 1026"},{"$f":"IF((VLOOKUP(Wycena!$C$7,Mapping!$Q$15:$R$20,2,0))=\"tak\",\"\",AA43)","v":"RAL 1026"},{"$f":"IF(ROWS($AB$3:AB43)>(ROWS($AB$3:$AB$229)-COUNTBLANK($AB$3:$AB$229)),\"\",INDEX($AB$3:$AB$229,SMALL(IF($AB$3:$AB$229<>\"\",ROW($AB$3:$AB$229)-2),ROWS($AB$3:AB43))))","v":{"$error":"#N/A"}},null,null,null,null,null,null,null,null,null,null,null,null,null,null,null,null,null,null,null,null,112,0,0,{"$f":"IF(Wycena!$C$16=78,Mapping!AY43,AZ43)","v":0},null,null,220,0,0,{"$f":"IF(Wycena!$C$16=78,Mapping!BE43,BF43)","v":0},null,null,null,null,null,null,null,null,null,null,null,null,null,null,null,null,null,null,null,null,null,null,null,null,null,null,null,null,null,null,null,null,null,"Przy skrzydle z dwóch stron",null,{"$f":"-IF(Wycena!$C$14=\"Przylgowe\",8,IF(Wycena!$C$14=\"Bezprzylgowe\",6,0))","v":-8},0,{"$f":"-IF(Wycena!$C$14=\"Przylgowe\",8,IF(Wycena!$C$14=\"Bezprzylgowe\",6,0))","v":-8},null,null,null,null,null,null,null,null,null,null,null,null,null,null,null,null,null,null,null,null,null,null,null,null,null,null,null,null,null,null,null,null,null,null,null,null,null,null,null,null,null,null,null,null,null,null,null,null,null,null,null,null,null,null,null,null,null,null,null,null,null,null,null,null,null,null,null,null,null,null,null,null,null,null,null,null,null,null,null,null,null,null,null,null,null,null,null,null,null,null,null,null,null,"Zestaw UNILOCK WIFI",6,null,null,"Klamko - gałka AXA Haga Plus","Inox"]
["DB 69",20,20,20,20,34,34,36,36,null,null,null,null,null,null,null,null,null,null,null,null,null,null,null,"RAL 1027",500,"RAL 1027",{"$f":"IF((VLOOKUP(Wycena!$C$7,Mapping!$Q$15:$R$20,2,0))=\"tak\",\"\",AA44)","v":"RAL 1027"},{"$f":"IF(ROWS($AB$3:AB44)>(ROWS($AB$3:$AB$229)-COUNTBLANK($AB$3:$AB$229)),\"\",INDEX($AB$3:$AB$229,SMALL(IF($AB$3:$AB$229<>\"\",ROW($AB$3:$AB$229)-2),ROWS($AB$3:AB44))))","v":{"$error":"#N/A"}},null,null,null,null,null,null,null,null,null,null,null,null,null,null,null,null,null,null,null,null,113,0,0,{"$f":"IF(Wycena!$C$16=78,Mapping!AY44,AZ44)","v":0},null,null,221,0,0,{"$f":"IF(Wycena!$C$16=78,Mapping!BE44,BF44)","v":0},null,null,null,null,null,null,null,null,null,null,null,null,null,null,null,null,null,null,null,null,null,null,null,null,null,null,null,null,null,null,null,null,null,"Przy skrzydle i ościeżnicy od zewnątrz",null,{"$f":"-IF(Wycena!$C$14=\"Przylgowe\",8,IF(Wycena!$C$14=\"Bezprzylgowe\",6,0))","v":-8},0,{"$f":"-IF(Wycena!$C$14=\"Przylgowe\",8,IF(Wycena!$C$14=\"Bezprzylgowe\",6,0))","v":-8},null,null,null,null,null,null,null,null,null,null,null,null,null,null,null,null,null,null,null,null,null,null,null,null,null,null,null,null,null,null,null,null,null,null,null,null,null,null,null,null,null,null,null,null,null,null,null,null,null,null,null,null,null,null,null,null,null,null,null,null,null,null,null,null,null,null,null,null,null,null,null,null,null,null,null,null,null,null,null,null,null,null,null,null,null,null,null,null,null,null,null,null,null,null,null,null,null,"Klamko - gałka AXA Haga Plus","Tytan"]
["DB 70",20,20,20,20,34,34,36,36,null,null,null,null,null,null,null,null,null,null,null,null,null,null,null,"RAL 1028",500,"RAL 1028",{"$f":"IF((VLOOKUP(Wycena!$C$7,Mapping!$Q$15:$R$20,2,0))=\"tak\",\"\",AA45)","v":"RAL 1028"},{"$f":"IF(ROWS($AB$3:AB45)>(ROWS($AB$3:$AB$229)-COUNTBLANK($AB$3:$AB$229)),\"\",INDEX($AB$3:$AB$229,SMALL(IF($AB$3:$AB$229<>\"\",ROW($AB$3:$AB$229)-2),ROWS($AB$3:AB45))))","v":{"$error":"#N/A"}},null,null,null,null,null,null,null,null,null,null,null,null,null,null,null,null,null,null,null,null,114,0,0,{"$f":"IF(Wycena!$C$16=78,Mapping!AY45,AZ45)","v":0},null,null,222,0,0,{"$f":"IF(Wycena!$C$16=78,Mapping!BE45,BF45)","v":0},null,null,null,null,null,null,null,null,null,null,null,null,null,null,null,null,null,null,null,null,null,null,null,null,null,null,null,null,null,null,null,null,null,"Przy skrzydle i ościeżnicy z dwóch stron",null,{"$f":"-IF(Wycena!$C$14=\"Przylgowe\",8,IF(Wycena!$C$14=\"Bezprzylgowe\",6,0))","v":-8},0,{"$f":"-IF(Wycena!$C$14=\"Przylgowe\",8,IF(Wycena!$C$14=\"Bezprzylgowe\",6,0))","v":-8},null,null,null,null,null,null,null,null,null,null,null,null,null,null,null,null,null,null,null,null,null,null,null,null,null,null,null,null,null,null,null,null,null,null,null,null,null,null,null,null,null,null,null,null,null,null,null,null,null,null,null,null,null,null,null,null,null,null,null,null,null,null,null,null,null,null,null,null,null,null,null,null,null,null,null,null,null,null,null,null,null,null,null,null,null,null,null,null,null,null,null,null,null,null,null,null,null,"Klamko - gałka AXA Haga Plus","Stare złoto"]
["DB 71a",20,20,20,20,34,34,36,36,null,null,null,null,null,null,null,null,null,null,null,null,null,null,null,"RAL 1032",500,"RAL 1032",{"$f":"IF((VLOOKUP(Wycena!$C$7,Mapping!$Q$15:$R$20,2,0))=\"tak\",\"\",AA46)","v":"RAL 1032"},{"$f":"IF(ROWS($AB$3:AB46)>(ROWS($AB$3:$AB$229)-COUNTBLANK($AB$3:$AB$229)),\"\",INDEX($AB$3:$AB$229,SMALL(IF($AB$3:$AB$229<>\"\",ROW($AB$3:$AB$229)-2),ROWS($AB$3:AB46))))","v":{"$error":"#N/A"}},null,null,null,null,null,null,null,null,null,null,null,null,null,null,null,null,null,null,null,null,115,0,0,{"$f":"IF(Wycena!$C$16=78,Mapping!AY46,AZ46)","v":0},null,null,223,0,0,{"$f":"IF(Wycena!$C$16=78,Mapping!BE46,BF46)","v":0},null,null,null,null,null,null,null,null,null,null,null,null,null,null,null,null,null,null,null,null,null,null,null,null,null,null,null,null,null,null,null,null,null,"Przy skrzydle i naświetlu od zewnątrz",null,{"$f":"-IF(Wycena!$C$14=\"Przylgowe\",8,IF(Wycena!$C$14=\"Bezprzylgowe\",6,0))","v":-8},0,{"$f":"-IF(Wycena!$C$14=\"Przylgowe\",8,IF(Wycena!$C$14=\"Bezprzylgowe\",6,0))","v":-8},null,null,null,null,null,null,null,null,null,null,null,null,null,null,null,null,null,null,null,null,null,null,null,null,null,null,null,null,null,null,null,null,null,null,null,null,null,null,null,null,null,null,null,null,null,null,null,null,null,null,null,null,null,null,null,null,null,null,null,null,null,null,null,null,null,null,null,null,null,null,null,null,null,null,null,null,null,null,null,null,null,null,null,null,null,null,null,null,null,null,null,null,null,null,null,null,null,"Klamko - gałka AXA Haga Plus","Czarny"]
["DB 72a",20,20,20,20,34,34,36,36,null,null,null,null,null,null,null,null,null,null,null,null,null,null,null,"RAL 1033",500,"RAL 1033",{"$f":"IF((VLOOKUP(Wycena!$C$7,Mapping!$Q$15:$R$20,2,0))=\"tak\",\"\",AA47)","v":"RAL 1033"},{"$f":"IF(ROWS($AB$3:AB47)>(ROWS($AB$3:$AB$229)-COUNTBLANK($AB$3:$AB$229)),\"\",INDEX($AB$3:$AB$229,SMALL(IF($AB$3:$AB$229<>\"\",ROW($AB$3:$AB$229)-2),ROWS($AB$3:AB47))))","v":{"$error":"#N/A"}},null,null,null,null,null,null,null,null,null,null,null,null,null,null,null,null,null,null,null,null,116,0,0,{"$f":"IF(Wycena!$C$16=78,Mapping!AY47,AZ47)","v":0},null,null,224,0,0,{"$f":"IF(Wycena!$C$16=78,Mapping!BE47,BF47)","v":0},null,null,null,null,null,null,null,null,null,null,null,null,null,null,null,null,null,null,null,null,null,null,null,null,null,null,null,null,null,null,null,null,null,"Przy skrzydle i naświetlu z dwóch stron",null,{"$f":"-IF(Wycena!$C$14=\"Przylgowe\",8,IF(Wycena!$C$14=\"Bezprzylgowe\",6,0))","v":-8},0,{"$f":"-IF(Wycena!$C$14=\"Przylgowe\",8,IF(Wycena!$C$14=\"Bezprzylgowe\",6,0))","v":-8},null,null,null,null,null,null,null,null,null,null,null,null,null,null,null,null,null,null,null,null,null,null,null,null,null,null,null,null,null,null,null,null,null,null,null,null,null,null,null,null,null,null,null,null,null,null,null,null,null,null,null,null,null,null,null,null,null,null,null,null,null,null,null,null,null,null,null,null,null,null,null,null,null,null,null,null,null,null,null,null,null,null,null,null,null,null,null,null,null,null,null,null,null,null,null,null,null,"Klamko - gałka AXA Prestige Flex","Inox"]
["DB 73",20,20,20,20,34,34,36,36,null,null,null,null,null,null,null,null,null,null,null,null,null,null,null,"RAL 1034",500,"RAL 1034",{"$f":"IF((VLOOKUP(Wycena!$C$7,Mapping!$Q$15:$R$20,2,0))=\"tak\",\"\",AA48)","v":"RAL 1034"},{"$f":"IF(ROWS($AB$3:AB48)>(ROWS($AB$3:$AB$229)-COUNTBLANK($AB$3:$AB$229)),\"\",INDEX($AB$3:$AB$229,SMALL(IF($AB$3:$AB$229<>\"\",ROW($AB$3:$AB$229)-2),ROWS($AB$3:AB48))))","v":{"$error":"#N/A"}},null,null,null,null,null,null,null,null,null,null,null,null,null,null,null,null,null,null,null,null,117,0,0,{"$f":"IF(Wycena!$C$16=78,Mapping!AY48,AZ48)","v":0},null,null,225,0,0,{"$f":"IF(Wycena!$C$16=78,Mapping!BE48,BF48)","v":0},null,null,null,null,null,null,null,null,null,null,null,null,null,null,null,null,null,null,null,null,null,null,null,null,null,null,null,null,null,null,null,null,null,"Przy skrzydle, naświetlu i ościeżnicy od zewnątrz",null,{"$f":"-IF(Wycena!$C$14=\"Przylgowe\",8,IF(Wycena!$C$14=\"Bezprzylgowe\",6,0))","v":-8},0,{"$f":"-IF(Wycena!$C$14=\"Przylgowe\",8,IF(Wycena!$C$14=\"Bezprzylgowe\",6,0))","v":-8},null,null,null,null,null,null,null,null,null,null,null,null,null,null,null,null,null,null,null,null,null,null,null,null,null,null,null,null,null,null,null,null,null,null,null,null,null,null,null,null,null,null,null,null,null,null,null,null,null,null,null,null,null,null,null,null,null,null,null,null,null,null,null,null,null,null,null,null,null,null,null,null,null,null,null,null,null,null,null,null,null,null,null,null,null,null,null,null,null,null,null,null,null,null,null,null,null,"Klamko - gałka AXA Prestige Flex","Tytan"]
["DB 74",20,20,20,20,34,34,36,36,null,null,null,null,null,null,null,null,null,null,null,null,null,null,null,"RAL 1035",500,"RAL 1035",{"$f":"IF((VLOOKUP(Wycena!$C$7,Mapping!$Q$15:$R$20,2,0))=\"tak\",\"\",AA49)","v":"RAL 1035"},{"$f":"IF(ROWS($AB$3:AB49)>(ROWS($AB$3:$AB$229)-COUNTBLANK($AB$3:$AB$229)),\"\",INDEX($AB$3:$AB$229,SMALL(IF($AB$3:$AB$229<>\"\",ROW($AB$3:$AB$229)-2),ROWS($AB$3:AB49))))","v":{"$error":"#N/A"}},null,null,null,null,null,null,null,null,null,null,null,null,null,null,null,null,null,null,null,null,118,0,0,{"$f":"IF(Wycena!$C$16=78,Mapping!AY49,AZ49)","v":0},null,null,226,0,0,{"$f":"IF(Wycena!$C$16=78,Mapping!BE49,BF49)","v":0},null,null,null,null,null,null,null,null,null,null,null,null,null,null,null,null,null,null,null,null,null,null,null,null,null,null,null,null,null,null,null,null,null,"Przy skrzydle, naświetlu i ościeżnicy z dwóch stron",null,{"$f":"-IF(Wycena!$C$14=\"Przylgowe\",8,IF(Wycena!$C$14=\"Bezprzylgowe\",6,0))","v":-8},0,{"$f":"-IF(Wycena!$C$14=\"Przylgowe\",8,IF(Wycena!$C$14=\"Bezprzylgowe\",6,0))","v":-8},null,null,null,null,null,null,null,null,null,null,null,null,null,null,null,null,null,null,null,null,null,null,null,null,null,null,null,null,null,null,null,null,null,null,null,null,null,null,null,null,null,null,null,null,null,null,null,null,null,null,null,null,null,null,null,null,null,null,null,null,null,null,null,null,null,null,null,null,null,null,null,null,null,null,null,null,null,null,null,null,null,null,null,null,null,null,null,null,null,null,null,null,null,null,null,null,null,"Klamko - gałka AXA Prestige Flex","Stare złoto"]
["DB 77",20,20,20,20,34,34,36,36,null,null,null,null,null,null,null,null,null,null,null,null,null,null,null,"RAL 1036",500,"RAL 1036",{"$f":"IF((VLOOKUP(Wycena!$C$7,Mapping!$Q$15:$R$20,2,0))=\"tak\",\"\",AA50)","v":"RAL 1036"},{"$f":"IF(ROWS($AB$3:AB50)>(ROWS($AB$3:$AB$229)-COUNTBLANK($AB$3:$AB$229)),\"\",INDEX($AB$3:$AB$229,SMALL(IF($AB$3:$AB$229<>\"\",ROW($AB$3:$AB$229)-2),ROWS($AB$3:AB50))))","v":{"$error":"#N/A"}},null,null,null,null,null,null,null,null,null,null,null,null,null,null,null,null,null,null,null,null,119,0,0,{"$f":"IF(Wycena!$C$16=78,Mapping!AY50,AZ50)","v":0},null,null,227,0,0,{"$f":"IF(Wycena!$C$16=78,Mapping!BE50,BF50)","v":0},null,null,null,null,null,null,null,null,null,null,null,null,null,null,null,null,null,null,null,null,null,null,null,null,null,null,null,null,null,null,null,null,null,null,null,null,null,null,null,null,null,null,null,null,null,null,null,null,null,null,null,null,null,null,null,null,null,null,null,null,null,null,null,null,null,null,null,null,null,null,null,null,null,null,null,null,null,null,null,null,null,null,null,null,null,null,null,null,null,null,null,null,null,null,null,null,null,null,null,null,null,null,null,null,null,null,null,null,null,null,null,null,null,null,null,null,null,null,null,null,null,null,null,null,null,null,null,null,null,null,null,null,null,null,null,"Pochwyt Palermo w zestawie","Inox błysk"]
["DB 78",20,20,20,20,34,34,36,36,null,null,null,null,null,null,null,null,null,null,null,null,null,null,null,"RAL 1037",500,"RAL 1037",{"$f":"IF((VLOOKUP(Wycena!$C$7,Mapping!$Q$15:$R$20,2,0))=\"tak\",\"\",AA51)","v":"RAL 1037"},{"$f":"IF(ROWS($AB$3:AB51)>(ROWS($AB$3:$AB$229)-COUNTBLANK($AB$3:$AB$229)),\"\",INDEX($AB$3:$AB$229,SMALL(IF($AB$3:$AB$229<>\"\",ROW($AB$3:$AB$229)-2),ROWS($AB$3:AB51))))","v":{"$error":"#N/A"}},null,null,null,null,null,null,null,null,null,null,null,null,null,null,null,null,null,null,null,null,120,0,0,{"$f":"IF(Wycena!$C$16=78,Mapping!AY51,AZ51)","v":0},null,null,228,0,0,{"$f":"IF(Wycena!$C$16=78,Mapping!BE51,BF51)","v":0},null,null,null,null,null,null,null,null,null,null,null,null,null,null,null,null,null,null,null,null,null,null,null,null,null,null,null,null,null,null,null,null,null,{"$f":"VLOOKUP(Wycena!C26,Mapping!$CO$52:$CS$61,IF(AND(Wycena!C20=\"-\",Wycena!C21=\"-\"),2,IF(AND(Wycena!C20<>\"-\",Wycena!C21=\"-\"),3,IF(AND(Wycena!C20=\"-\",Wycena!C21<>\"-\"),4,5))),0)","v":0},null,null,null,null,null,null,null,null,null,null,null,null,null,null,null,null,null,null,null,null,null,null,null,null,null,null,null,null,null,null,null,null,null,null,null,null,null,null,null,null,null,null,null,null,null,null,null,null,null,null,null,null,null,null,null,null,null,null,null,null,null,null,null,null,null,null,null,null,null,null,null,null,null,null,null,null,null,null,null,null,null,null,null,null,null,null,null,null,null,null,null,null,null,null,null,null,null,null,null,null,null,"Pochwyt Palermo w zestawie","Złoty błysk"]
["DB 79",20,20,20,20,34,34,36,36,null,null,null,null,null,null,null,null,null,null,null,null,null,null,null,"RAL 2000",500,"RAL 2000",{"$f":"IF((VLOOKUP(Wycena!$C$7,Mapping!$Q$15:$R$20,2,0))=\"tak\",\"\",AA52)","v":"RAL 2000"},{"$f":"IF(ROWS($AB$3:AB52)>(ROWS($AB$3:$AB$229)-COUNTBLANK($AB$3:$AB$229)),\"\",INDEX($AB$3:$AB$229,SMALL(IF($AB$3:$AB$229<>\"\",ROW($AB$3:$AB$229)-2),ROWS($AB$3:AB52))))","v":{"$error":"#N/A"}},null,null,null,null,null,null,null,null,null,null,null,null,null,null,null,null,null,null,null,null,121,0,0,{"$f":"IF(Wycena!$C$16=78,Mapping!AY52,AZ52)","v":0},null,null,229,0,0,{"$f":"IF(Wycena!$C$16=78,Mapping!BE52,BF52)","v":0},null,null,null,null,null,null,null,null,null,null,null,null,null,null,null,null,null,null,null,null,null,null,null,null,null,null,null,null,null,null,null,null,null,"Dla dostawki od zamka","SOLO","DOSTAWKA OD ZAWIAS","DOSTAWKA OD ZAMKA","2 DOSTAWKI",null,null,null,null,null,null,null,null,null,null,null,null,null,null,null,null,null,null,null,null,null,null,null,null,null,null,null,null,null,null,null,null,null,null,null,null,null,null,null,null,null,null,null,null,null,null,null,null,null,null,null,null,null,null,null,null,null,null,null,null,null,null,null,null,null,null,null,null,null,null,null,null,null,null,null,null,null,null,null,null,null,null,null,null,null,null,null,null,null,null,null,null,null,null,null,null,null,"Pochwyt Palermo w zestawie","Stare złoto"]
["DB 80",20,20,20,20,34,34,36,36,null,null,null,null,null,null,null,null,null,null,null,null,null,null,null,"RAL 2001",500,"RAL 2001",{"$f":"IF((VLOOKUP(Wycena!$C$7,Mapping!$Q$15:$R$20,2,0))=\"tak\",\"\",AA53)","v":"RAL 2001"},{"$f":"IF(ROWS($AB$3:AB53)>(ROWS($AB$3:$AB$229)-COUNTBLANK($AB$3:$AB$229)),\"\",INDEX($AB$3:$AB$229,SMALL(IF($AB$3:$AB$229<>\"\",ROW($AB$3:$AB$229)-2),ROWS($AB$3:AB53))))","v":{"$error":"#N/A"}},null,null,null,null,null,null,null,null,null,null,null,null,null,null,null,null,null,null,null,null,122,0,0,{"$f":"IF(Wycena!$C$16=78,Mapping!AY53,AZ53)","v":0},null,null,230,0,0,{"$f":"IF(Wycena!$C$16=78,Mapping!BE53,BF53)","v":0},null,null,null,null,null,null,null,null,null,null,null,null,null,null,null,null,null,null,null,null,null,null,null,null,null,null,null,null,null,null,null,null,null,"-",0,0,0,0,null,null,null,null,null,null,null,null,null,null,null,null,null,null,null,null,null,null,null,null,null,null,null,null,null,null,null,null,null,null,null,null,null,null,null,null,null,null,null,null,null,null,null,null,null,null,null,null,null,null,null,null,null,null,null,null,null,null,null,null,null,null,null,null,null,null,null,null,null,null,null,null,null,null,null,null,null,null,null,null,null,null,null,null,null,null,null,null,null,null,null,null,null,null,null,null,null,"Pochwyt Palermo w zestawie","Srebro antyczne"]
["DB 81",20,20,20,20,34,34,36,36,null,null,null,null,null,null,null,null,null,null,null,null,null,null,null,"RAL 2002",500,"RAL 2002",{"$f":"IF((VLOOKUP(Wycena!$C$7,Mapping!$Q$15:$R$20,2,0))=\"tak\",\"\",AA54)","v":"RAL 2002"},{"$f":"IF(ROWS($AB$3:AB54)>(ROWS($AB$3:$AB$229)-COUNTBLANK($AB$3:$AB$229)),\"\",INDEX($AB$3:$AB$229,SMALL(IF($AB$3:$AB$229<>\"\",ROW($AB$3:$AB$229)-2),ROWS($AB$3:AB54))))","v":{"$error":"#N/A"}},null,null,null,null,null,null,null,null,null,null,null,null,null,null,null,null,null,null,null,null,123,0,0,{"$f":"IF(Wycena!$C$16=78,Mapping!AY54,AZ54)","v":0},null,null,231,0,0,{"$f":"IF(Wycena!$C$16=78,Mapping!BE54,BF54)","v":0},null,null,null,null,null,null,null,null,null,null,null,null,null,null,null,null,null,null,null,null,null,null,null,null,null,null,null,null,null,null,null,null,null,"Przy skrzydle od zewnątrz",null,0,{"$f":"-IF(Wycena!$C$14=\"Przylgowe\",8,IF(Wycena!$C$14=\"Bezprzylgowe\",6,0))","v":-8},{"$f":"-IF(Wycena!$C$14=\"Przylgowe\",8,IF(Wycena!$C$14=\"Bezprzylgowe\",6,0))","v":-8},null,null,null,null,null,null,null,null,null,null,null,null,null,null,null,null,null,null,null,null,null,null,null,null,null,null,null,null,null,null,null,null,null,null,null,null,null,null,null,null,null,null,null,null,null,null,null,null,null,null,null,null,null,null,null,null,null,null,null,null,null,null,null,null,null,null,null,null,null,null,null,null,null,null,null,null,null,null,null,null,null,null,null,null,null,null,null,null,null,null,null,null,null,null,null,null,null,"Pochwyt Eva","Inox"]
["DB 83",20,20,20,20,34,34,36,36,null,null,null,null,null,null,null,null,null,null,null,null,null,null,null,"RAL 2003",500,"RAL 2003",{"$f":"IF((VLOOKUP(Wycena!$C$7,Mapping!$Q$15:$R$20,2,0))=\"tak\",\"\",AA55)","v":"RAL 2003"},{"$f":"IF(ROWS($AB$3:AB55)>(ROWS($AB$3:$AB$229)-COUNTBLANK($AB$3:$AB$229)),\"\",INDEX($AB$3:$AB$229,SMALL(IF($AB$3:$AB$229<>\"\",ROW($AB$3:$AB$229)-2),ROWS($AB$3:AB55))))","v":{"$error":"#N/A"}},null,null,null,null,null,null,null,null,null,null,null,null,null,null,null,null,null,null,null,null,124,0,0,{"$f":"IF(Wycena!$C$16=78,Mapping!AY55,AZ55)","v":0},null,null,232,0,0,{"$f":"IF(Wycena!$C$16=78,Mapping!BE55,BF55)","v":0},null,null,null,null,null,null,null,null,null,null,null,null,null,null,null,null,null,null,null,null,null,null,null,null,null,null,null,null,null,null,null,null,null,"Przy skrzydle z dwóch stron",null,0,{"$f":"-IF(Wycena!$C$14=\"Przylgowe\",8,IF(Wycena!$C$14=\"Bezprzylgowe\",6,0))","v":-8},{"$f":"-IF(Wycena!$C$14=\"Przylgowe\",8,IF(Wycena!$C$14=\"Bezprzylgowe\",6,0))","v":-8},null,null,null,null,null,null,null,null,null,null,null,null,null,null,null,null,null,null,null,null,null,null,null,null,null,null,null,null,null,null,null,null,null,null,null,null,null,null,null,null,null,null,null,null,null,null,null,null,null,null,null,null,null,null,null,null,null,null,null,null,null,null,null,null,null,null,null,null,null,null,null,null,null,null,null,null,null,null,null,null,null,null,null,null,null,null,null,null,null,null,null,null,null,null,null,null,null,"Pochwyt Eva","Stare złoto"]
["DB 85",20,20,34,34,44,44,46,46,null,null,null,null,null,null,null,null,null,null,null,null,null,null,null,"RAL 2004",500,"RAL 2004",{"$f":"IF((VLOOKUP(Wycena!$C$7,Mapping!$Q$15:$R$20,2,0))=\"tak\",\"\",AA56)","v":"RAL 2004"},{"$f":"IF(ROWS($AB$3:AB56)>(ROWS($AB$3:$AB$229)-COUNTBLANK($AB$3:$AB$229)),\"\",INDEX($AB$3:$AB$229,SMALL(IF($AB$3:$AB$229<>\"\",ROW($AB$3:$AB$229)-2),ROWS($AB$3:AB56))))","v":{"$error":"#N/A"}},null,null,null,null,null,null,null,null,null,null,null,null,null,null,null,null,null,null,null,null,125,0,0,{"$f":"IF(Wycena!$C$16=78,Mapping!AY56,AZ56)","v":0},null,null,233,0,0,{"$f":"IF(Wycena!$C$16=78,Mapping!BE56,BF56)","v":0},null,null,null,null,null,null,null,null,null,null,null,null,null,null,null,null,null,null,null,null,null,null,null,null,null,null,null,null,null,null,null,null,null,"Przy skrzydle i ościeżnicy od zewnątrz",null,0,{"$f":"-IF(Wycena!$C$14=\"Przylgowe\",8,IF(Wycena!$C$14=\"Bezprzylgowe\",6,0))","v":-8},{"$f":"-IF(Wycena!$C$14=\"Przylgowe\",8,IF(Wycena!$C$14=\"Bezprzylgowe\",6,0))","v":-8},null,null,null,null,null,null,null,null,null,null,null,null,null,null,null,null,null,null,null,null,null,null,null,null,null,null,null,null,null,null,null,null,null,null,null,null,null,null,null,null,null,null,null,null,null,null,null,null,null,null,null,null,null,null,null,null,null,null,null,null,null,null,null,null,null,null,null,null,null,null,null,null,null,null,null,null,null,null,null,null,null,null,null,null,null,null,null,null,null,null,null,null,null,null,null,null,null,"Pochwyt Eva","Czarny mat"]
["DB 87a",20,20,34,34,44,44,{"$f":"F57+2","v":46},{"$f":"G57+2","v":46},null,null,null,null,null,null,null,null,null,null,null,null,null,null,null,"RAL 2005",500,"RAL 2005",{"$f":"IF((VLOOKUP(Wycena!$C$7,Mapping!$Q$15:$R$20,2,0))=\"tak\",\"\",AA57)","v":"RAL 2005"},{"$f":"IF(ROWS($AB$3:AB57)>(ROWS($AB$3:$AB$229)-COUNTBLANK($AB$3:$AB$229)),\"\",INDEX($AB$3:$AB$229,SMALL(IF($AB$3:$AB$229<>\"\",ROW($AB$3:$AB$229)-2),ROWS($AB$3:AB57))))","v":{"$error":"#N/A"}},null,null,null,null,null,null,null,null,null,null,null,null,null,null,null,null,null,null,null,null,126,0,0,{"$f":"IF(Wycena!$C$16=78,Mapping!AY57,AZ57)","v":0},null,null,234,0,0,{"$f":"IF(Wycena!$C$16=78,Mapping!BE57,BF57)","v":0},null,null,null,null,null,null,null,null,null,null,null,null,null,null,null,null,null,null,null,null,null,null,null,null,null,null,null,null,null,null,null,null,null,"Przy skrzydle i ościeżnicy z dwóch stron",null,0,{"$f":"-IF(Wycena!$C$14=\"Przylgowe\",8,IF(Wycena!$C$14=\"Bezprzylgowe\",6,0))","v":-8},{"$f":"-IF(Wycena!$C$14=\"Przylgowe\",8,IF(Wycena!$C$14=\"Bezprzylgowe\",6,0))","v":-8},null,null,null,null,null,null,null,null,null,null,null,null,null,null,null,null,null,null,null,null,null,null,null,null,null,null,null,null,null,null,null,null,null,null,null,null,null,null,null,null,null,null,null,null,null,null,null,null,null,null,null,null,null,null,null,null,null,null,null,null,null,null,null,null,null,null,null,null,null,null,null,null,null,null,null,null,null,null,null,null,null,null,null,null,null,null,null,null,null,null,null,null,null,null,null,null,null,"Pochwyt Maddalena","Inox"]
["DB 94",20,20,34,34,44,44,46,46,null,null,null,null,null,null,null,null,null,null,null,null,null,null,null,"RAL 2007",500,"RAL 2007",{"$f":"IF((VLOOKUP(Wycena!$C$7,Mapping!$Q$15:$R$20,2,0))=\"tak\",\"\",AA58)","v":"RAL 2007"},{"$f":"IF(ROWS($AB$3:AB58)>(ROWS($AB$3:$AB$229)-COUNTBLANK($AB$3:$AB$229)),\"\",INDEX($AB$3:$AB$229,SMALL(IF($AB$3:$AB$229<>\"\",ROW($AB$3:$AB$229)-2),ROWS($AB$3:AB58))))","v":{"$error":"#N/A"}},null,null,null,null,null,null,null,null,null,null,null,null,null,null,null,null,null,null,null,null,127,0,0,{"$f":"IF(Wycena!$C$16=78,Mapping!AY58,AZ58)","v":0},null,null,235,0,0,{"$f":"IF(Wycena!$C$16=78,Mapping!BE58,BF58)","v":0},null,null,null,null,null,null,null,null,null,null,null,null,null,null,null,null,null,null,null,null,null,null,null,null,null,null,null,null,null,null,null,null,null,"Przy skrzydle i naświetlu od zewnątrz",null,0,{"$f":"-IF(Wycena!$C$14=\"Przylgowe\",8,IF(Wycena!$C$14=\"Bezprzylgowe\",6,0))","v":-8},{"$f":"-IF(Wycena!$C$14=\"Przylgowe\",8,IF(Wycena!$C$14=\"Bezprzylgowe\",6,0))","v":-8},null,null,null,null,null,null,null,null,null,null,null,null,null,null,null,null,null,null,null,null,null,null,null,null,null,null,null,null,null,null,null,null,null,null,null,null,null,null,null,null,null,null,null,null,null,null,null,null,null,null,null,null,null,null,null,null,null,null,null,null,null,null,null,null,null,null,null,null,null,null,null,null,null,null,null,null,null,null,null,null,null,null,null,null,null,null,null,null,null,null,null,null,null,null,null,null,null,"Pochwyt Maddalena","Stare złoto"]
["DB 106",20,20,34,34,44,44,46,46,null,null,null,null,null,null,null,null,null,null,null,null,null,null,null,"RAL 2008",500,"RAL 2008",{"$f":"IF((VLOOKUP(Wycena!$C$7,Mapping!$Q$15:$R$20,2,0))=\"tak\",\"\",AA59)","v":"RAL 2008"},{"$f":"IF(ROWS($AB$3:AB59)>(ROWS($AB$3:$AB$229)-COUNTBLANK($AB$3:$AB$229)),\"\",INDEX($AB$3:$AB$229,SMALL(IF($AB$3:$AB$229<>\"\",ROW($AB$3:$AB$229)-2),ROWS($AB$3:AB59))))","v":{"$error":"#N/A"}},null,null,null,null,null,null,null,null,null,null,null,null,null,null,null,null,null,null,null,null,128,0,0,{"$f":"IF(Wycena!$C$16=78,Mapping!AY59,AZ59)","v":0},null,null,236,0,0,{"$f":"IF(Wycena!$C$16=78,Mapping!BE59,BF59)","v":0},null,null,null,null,null,null,null,null,null,null,null,null,null,null,null,null,null,null,null,null,null,null,null,null,null,null,null,null,null,null,null,null,null,"Przy skrzydle i naświetlu z dwóch stron",null,0,{"$f":"-IF(Wycena!$C$14=\"Przylgowe\",8,IF(Wycena!$C$14=\"Bezprzylgowe\",6,0))","v":-8},{"$f":"-IF(Wycena!$C$14=\"Przylgowe\",8,IF(Wycena!$C$14=\"Bezprzylgowe\",6,0))","v":-8},null,null,null,null,null,null,null,null,null,null,null,null,null,null,null,null,null,null,null,null,null,null,null,null,null,null,null,null,null,null,null,null,null,null,null,null,null,null,null,null,null,null,null,null,null,null,null,null,null,null,null,null,null,null,null,null,null,null,null,null,null,null,null,null,null,null,null,null,null,null,null,null,null,null,null,null,null,null,null,null,null,null,null,null,null,null,null,null,null,null,null,null,null,null,null,null,null,"Pochwyt Maddalena","Czarny mat"]
["DB 106a",20,20,34,34,44,44,46,46,null,null,null,null,null,null,null,null,null,null,null,null,null,null,null,"RAL 2009",500,"RAL 2009",{"$f":"IF((VLOOKUP(Wycena!$C$7,Mapping!$Q$15:$R$20,2,0))=\"tak\",\"\",AA60)","v":"RAL 2009"},{"$f":"IF(ROWS($AB$3:AB60)>(ROWS($AB$3:$AB$229)-COUNTBLANK($AB$3:$AB$229)),\"\",INDEX($AB$3:$AB$229,SMALL(IF($AB$3:$AB$229<>\"\",ROW($AB$3:$AB$229)-2),ROWS($AB$3:AB60))))","v":{"$error":"#N/A"}},null,null,null,null,null,null,null,null,null,null,null,null,null,null,null,null,null,null,null,null,129,0,0,{"$f":"IF(Wycena!$C$16=78,Mapping!AY60,AZ60)","v":0},null,null,237,0,0,{"$f":"IF(Wycena!$C$16=78,Mapping!BE60,BF60)","v":0},null,null,null,null,null,null,null,null,null,null,null,null,null,null,null,null,null,null,null,null,null,null,null,null,null,null,null,null,null,null,null,null,null,"Przy skrzydle, naświetlu i ościeżnicy od zewnątrz",null,0,{"$f":"-IF(Wycena!$C$14=\"Przylgowe\",8,IF(Wycena!$C$14=\"Bezprzylgowe\",6,0))","v":-8},{"$f":"-IF(Wycena!$C$14=\"Przylgowe\",8,IF(Wycena!$C$14=\"Bezprzylgowe\",6,0))","v":-8},null,null,null,null,null,null,null,null,null,null,null,null,null,null,null,null,null,null,null,null,null,null,null,null,null,null,null,null,null,null,null,null,null,null,null,null,null,null,null,null,null,null,null,null,null,null,null,null,null,null,null,null,null,null,null,null,null,null,null,null,null,null,null,null,null,null,null,null,null,null,null,null,null,null,null,null,null,null,null,null,null,null,null,null,null,null,null,null,null,null,null,null,null,null,null,null,null,"Antaba Medos Lisbon prostokątna prosta + klamka Warszawa","Inox"]
["DB 107",20,20,34,34,44,44,46,46,null,null,null,null,null,null,null,null,null,null,null,null,null,null,null,"RAL 2010",500,"RAL 2010",{"$f":"IF((VLOOKUP(Wycena!$C$7,Mapping!$Q$15:$R$20,2,0))=\"tak\",\"\",AA61)","v":"RAL 2010"},{"$f":"IF(ROWS($AB$3:AB61)>(ROWS($AB$3:$AB$229)-COUNTBLANK($AB$3:$AB$229)),\"\",INDEX($AB$3:$AB$229,SMALL(IF($AB$3:$AB$229<>\"\",ROW($AB$3:$AB$229)-2),ROWS($AB$3:AB61))))","v":{"$error":"#N/A"}},null,null,null,null,null,null,null,null,null,null,null,null,null,null,null,null,null,null,null,null,130,0,0,{"$f":"IF(Wycena!$C$16=78,Mapping!AY61,AZ61)","v":0},null,null,238,0,0,{"$f":"IF(Wycena!$C$16=78,Mapping!BE61,BF61)","v":0},null,null,null,null,null,null,null,null,null,null,null,null,null,null,null,null,null,null,null,null,null,null,null,null,null,null,null,null,null,null,null,null,null,"Przy skrzydle, naświetlu i ościeżnicy z dwóch stron",null,0,{"$f":"-IF(Wycena!$C$14=\"Przylgowe\",8,IF(Wycena!$C$14=\"Bezprzylgowe\",6,0))","v":-8},{"$f":"-IF(Wycena!$C$14=\"Przylgowe\",8,IF(Wycena!$C$14=\"Bezprzylgowe\",6,0))","v":-8},null,null,null,null,null,null,null,null,null,null,null,null,null,null,null,null,null,null,null,null,null,null,null,null,null,null,null,null,null,null,null,null,null,null,null,null,null,null,null,null,null,null,null,null,null,null,null,null,null,null,null,null,null,null,null,null,null,null,null,null,null,null,null,null,null,null,null,null,null,null,null,null,null,null,null,null,null,null,null,null,null,null,null,null,null,null,null,null,null,null,null,null,null,null,null,null,null,"Antaba Medos Lisbon prostokątna prosta + klamka Warszawa","Stare złoto"]
["DB 108",20,20,34,34,44,44,46,46,null,null,null,null,null,null,null,null,null,null,null,null,null,null,null,"RAL 2011",500,"RAL 2011",{"$f":"IF((VLOOKUP(Wycena!$C$7,Mapping!$Q$15:$R$20,2,0))=\"tak\",\"\",AA62)","v":"RAL 2011"},{"$f":"IF(ROWS($AB$3:AB62)>(ROWS($AB$3:$AB$229)-COUNTBLANK($AB$3:$AB$229)),\"\",INDEX($AB$3:$AB$229,SMALL(IF($AB$3:$AB$229<>\"\",ROW($AB$3:$AB$229)-2),ROWS($AB$3:AB62))))","v":{"$error":"#N/A"}},null,null,null,null,null,null,null,null,null,null,null,null,null,null,null,null,null,null,null,null,131,1,0,{"$f":"IF(Wycena!$C$16=78,Mapping!AY62,AZ62)","v":0},null,null,239,0,0,{"$f":"IF(Wycena!$C$16=78,Mapping!BE62,BF62)","v":0},null,null,null,null,null,null,null,null,null,null,null,null,null,null,null,null,null,null,null,null,null,null,null,null,null,null,null,null,null,null,null,null,null,null,null,null,null,null,null,null,null,null,null,null,null,null,null,null,null,null,null,null,null,null,null,null,null,null,null,null,null,null,null,null,null,null,null,null,null,null,null,null,null,null,null,null,null,null,null,null,null,null,null,null,null,null,null,null,null,null,null,null,null,null,null,null,null,null,null,null,null,null,null,null,null,null,null,null,null,null,null,null,null,null,null,null,null,null,null,null,null,null,null,null,null,null,null,null,null,null,null,null,null,null,null,"Antaba Medos Lisbon prostokątna prosta + klamka Warszawa","Czarny"]
["DB 151",20,20,34,34,44,44,46,46,null,null,null,null,null,null,null,null,null,null,null,null,null,null,null,"RAL 2012",500,"RAL 2012",{"$f":"IF((VLOOKUP(Wycena!$C$7,Mapping!$Q$15:$R$20,2,0))=\"tak\",\"\",AA63)","v":"RAL 2012"},{"$f":"IF(ROWS($AB$3:AB63)>(ROWS($AB$3:$AB$229)-COUNTBLANK($AB$3:$AB$229)),\"\",INDEX($AB$3:$AB$229,SMALL(IF($AB$3:$AB$229<>\"\",ROW($AB$3:$AB$229)-2),ROWS($AB$3:AB63))))","v":{"$error":"#N/A"}},null,null,null,null,null,null,null,null,null,null,null,null,null,null,null,null,null,null,null,null,132,1,0,{"$f":"IF(Wycena!$C$16=78,Mapping!AY63,AZ63)","v":0},null,null,240,0,0,{"$f":"IF(Wycena!$C$16=78,Mapping!BE63,BF63)","v":0},null,null,null,null,null,null,null,null,null,null,null,null,null,null,null,null,null,null,null,null,null,null,null,null,null,null,null,null,null,null,null,null,null,null,null,null,null,null,null,null,null,null,null,null,null,null,null,null,null,null,null,null,null,null,null,null,null,null,null,null,null,null,null,null,null,null,null,null,null,null,null,null,null,null,null,null,null,null,null,null,null,null,null,null,null,null,null,null,null,null,null,null,null,null,null,null,null,null,null,null,null,null,null,null,null,null,null,null,null,null,null,null,null,null,null,null,null,null,null,null,null,null,null,null,null,null,null,null,null,null,null,null,null,null,null,"Antaba Medos Lisbon prostokątna skośna + klamka Warszawa","Inox"]
["DB 152",20,20,34,34,44,44,46,46,null,null,null,null,null,null,null,null,null,null,null,null,null,null,null,"RAL 2013",500,"RAL 2013",{"$f":"IF((VLOOKUP(Wycena!$C$7,Mapping!$Q$15:$R$20,2,0))=\"tak\",\"\",AA64)","v":"RAL 2013"},{"$f":"IF(ROWS($AB$3:AB64)>(ROWS($AB$3:$AB$229)-COUNTBLANK($AB$3:$AB$229)),\"\",INDEX($AB$3:$AB$229,SMALL(IF($AB$3:$AB$229<>\"\",ROW($AB$3:$AB$229)-2),ROWS($AB$3:AB64))))","v":{"$error":"#N/A"}},null,null,null,null,null,null,null,null,null,null,null,null,null,null,null,null,null,null,null,null,133,1,0,{"$f":"IF(Wycena!$C$16=78,Mapping!AY64,AZ64)","v":0},null,null,241,0,0,{"$f":"IF(Wycena!$C$16=78,Mapping!BE64,BF64)","v":0},null,null,null,null,null,null,null,null,null,null,null,null,null,null,null,null,null,null,null,null,null,null,null,null,null,null,null,null,null,null,null,null,null,null,null,null,null,null,null,null,null,null,null,null,null,null,null,null,null,null,null,null,null,null,null,null,null,null,null,null,null,null,null,null,null,null,null,null,null,null,null,null,null,null,null,null,null,null,null,null,null,null,null,null,null,null,null,null,null,null,null,null,null,null,null,null,null,null,null,null,null,null,null,null,null,null,null,null,null,null,null,null,null,null,null,null,null,null,null,null,null,null,null,null,null,null,null,null,null,null,null,null,null,null,null,"Antaba Medos Lisbon prostokątna skośna + klamka Warszawa","Stare złoto"]
["DB 153a",20,20,34,34,44,44,46,46,null,null,null,null,null,null,null,null,null,null,null,null,null,null,null,"RAL 3000",500,"RAL 3000",{"$f":"IF((VLOOKUP(Wycena!$C$7,Mapping!$Q$15:$R$20,2,0))=\"tak\",\"\",AA65)","v":"RAL 3000"},{"$f":"IF(ROWS($AB$3:AB65)>(ROWS($AB$3:$AB$229)-COUNTBLANK($AB$3:$AB$229)),\"\",INDEX($AB$3:$AB$229,SMALL(IF($AB$3:$AB$229<>\"\",ROW($AB$3:$AB$229)-2),ROWS($AB$3:AB65))))","v":{"$error":"#N/A"}},null,null,null,null,null,null,null,null,null,null,null,null,null,null,null,null,null,null,null,null,134,1,0,{"$f":"IF(Wycena!$C$16=78,Mapping!AY65,AZ65)","v":0},null,null,242,0,0,{"$f":"IF(Wycena!$C$16=78,Mapping!BE65,BF65)","v":0},null,null,null,null,null,null,null,null,null,null,null,null,null,null,null,null,null,null,null,null,null,null,null,null,null,null,null,null,null,null,null,null,null,null,null,null,null,null,null,null,null,null,null,null,null,null,null,null,null,null,null,null,null,null,null,null,null,null,null,null,null,null,null,null,null,null,null,null,null,null,null,null,null,null,null,null,null,null,null,null,null,null,null,null,null,null,null,null,null,null,null,null,null,null,null,null,null,null,null,null,null,null,null,null,null,null,null,null,null,null,null,null,null,null,null,null,null,null,null,null,null,null,null,null,null,null,null,null,null,null,null,null,null,null,null,"Antaba Medos Lisbon prostokątna skośna + klamka Warszawa","Czarny"]
["DB 154",20,20,34,34,44,44,46,46,null,null,null,null,null,null,null,null,null,null,null,null,null,null,null,"RAL 3001",500,"RAL 3001",{"$f":"IF((VLOOKUP(Wycena!$C$7,Mapping!$Q$15:$R$20,2,0))=\"tak\",\"\",AA66)","v":"RAL 3001"},{"$f":"IF(ROWS($AB$3:AB66)>(ROWS($AB$3:$AB$229)-COUNTBLANK($AB$3:$AB$229)),\"\",INDEX($AB$3:$AB$229,SMALL(IF($AB$3:$AB$229<>\"\",ROW($AB$3:$AB$229)-2),ROWS($AB$3:AB66))))","v":{"$error":"#N/A"}},null,null,null,null,null,null,null,null,null,null,null,null,null,null,null,null,null,null,null,null,135,1,1,{"$f":"IF(Wycena!$C$16=78,Mapping!AY66,AZ66)","v":1},null,null,243,0,0,{"$f":"IF(Wycena!$C$16=78,Mapping!BE66,BF66)","v":0},null,null,null,null,null,null,null,null,null,null,null,null,null,null,null,null,null,null,null,null,null,null,null,null,null,null,null,null,null,null,null,null,null,null,null,null,null,null,null,null,null,null,null,null,null,null,null,null,null,null,null,null,null,null,null,null,null,null,null,null,null,null,null,null,null,null,null,null,null,null,null,null,null,null,null,null,null,null,null,null,null,null,null,null,null,null,null,null,null,null,null,null,null,null,null,null,null,null,null,null,null,null,null,null,null,null,null,null,null,null,null,null,null,null,null,null,null,null,null,null,null,null,null,null,null,null,null,null,null,null,null,null,null,null,null,"Antaba Medos Madrid kwadratowa prosta + klamka Warszawa","Inox"]
["DB 157",20,20,34,34,44,44,46,46,null,null,null,null,null,null,null,null,null,null,null,null,null,null,null,"RAL 3002",500,"RAL 3002",{"$f":"IF((VLOOKUP(Wycena!$C$7,Mapping!$Q$15:$R$20,2,0))=\"tak\",\"\",AA67)","v":"RAL 3002"},{"$f":"IF(ROWS($AB$3:AB67)>(ROWS($AB$3:$AB$229)-COUNTBLANK($AB$3:$AB$229)),\"\",INDEX($AB$3:$AB$229,SMALL(IF($AB$3:$AB$229<>\"\",ROW($AB$3:$AB$229)-2),ROWS($AB$3:AB67))))","v":{"$error":"#N/A"}},null,null,null,null,null,null,null,null,null,null,null,null,null,null,null,null,null,null,null,null,136,1,1,{"$f":"IF(Wycena!$C$16=78,Mapping!AY67,AZ67)","v":1},null,null,244,0,0,{"$f":"IF(Wycena!$C$16=78,Mapping!BE67,BF67)","v":0},null,null,null,null,null,null,null,null,null,null,null,null,null,null,null,null,null,null,null,null,null,null,null,null,null,null,null,null,null,null,null,null,null,null,null,null,null,null,null,null,null,null,null,null,null,null,null,null,null,null,null,null,null,null,null,null,null,null,null,null,null,null,null,null,null,null,null,null,null,null,null,null,null,null,null,null,null,null,null,null,null,null,null,null,null,null,null,null,null,null,null,null,null,null,null,null,null,null,null,null,null,null,null,null,null,null,null,null,null,null,null,null,null,null,null,null,null,null,null,null,null,null,null,null,null,null,null,null,null,null,null,null,null,null,null,"Antaba Medos Madrid kwadratowa prosta + klamka Warszawa","Stare złoto"]
["DB 158",20,20,34,34,44,44,46,46,null,null,null,null,null,null,null,null,null,null,null,null,null,null,null,"RAL 3003",500,"RAL 3003",{"$f":"IF((VLOOKUP(Wycena!$C$7,Mapping!$Q$15:$R$20,2,0))=\"tak\",\"\",AA68)","v":"RAL 3003"},{"$f":"IF(ROWS($AB$3:AB68)>(ROWS($AB$3:$AB$229)-COUNTBLANK($AB$3:$AB$229)),\"\",INDEX($AB$3:$AB$229,SMALL(IF($AB$3:$AB$229<>\"\",ROW($AB$3:$AB$229)-2),ROWS($AB$3:AB68))))","v":{"$error":"#N/A"}},null,null,null,null,null,null,null,null,null,null,null,null,null,null,null,null,null,null,null,null,137,1,1,{"$f":"IF(Wycena!$C$16=78,Mapping!AY68,AZ68)","v":1},null,null,245,0,0,{"$f":"IF(Wycena!$C$16=78,Mapping!BE68,BF68)","v":0},null,null,null,null,null,null,null,null,null,null,null,null,null,null,null,null,null,null,null,null,null,null,null,null,null,null,null,null,null,null,null,null,null,null,null,null,null,null,null,null,null,null,null,null,null,null,null,null,null,null,null,null,null,null,null,null,null,null,null,null,null,null,null,null,null,null,null,null,null,null,null,null,null,null,null,null,null,null,null,null,null,null,null,null,null,null,null,null,null,null,null,null,null,null,null,null,null,null,null,null,null,null,null,null,null,null,null,null,null,null,null,null,null,null,null,null,null,null,null,null,null,null,null,null,null,null,null,null,null,null,null,null,null,null,null,"Antaba Medos Madrid kwadratowa prosta + klamka Warszawa","Czarny"]
["DB 159",20,20,34,34,44,44,46,46,null,null,null,null,null,null,null,null,null,null,null,null,null,null,null,"RAL 3004",500,{"$f":"Y69","v":"RAL 3004"},{"$f":"IF((VLOOKUP(Wycena!$C$7,Mapping!$Q$15:$R$20,2,0))=\"tak\",\"\",AA69)","v":"RAL 3004"},{"$f":"IF(ROWS($AB$3:AB69)>(ROWS($AB$3:$AB$229)-COUNTBLANK($AB$3:$AB$229)),\"\",INDEX($AB$3:$AB$229,SMALL(IF($AB$3:$AB$229<>\"\",ROW($AB$3:$AB$229)-2),ROWS($AB$3:AB69))))","v":{"$error":"#N/A"}},null,null,null,null,null,null,null,null,null,null,null,null,null,null,null,null,null,null,null,null,138,1,1,{"$f":"IF(Wycena!$C$16=78,Mapping!AY69,AZ69)","v":1},null,null,246,0,0,{"$f":"IF(Wycena!$C$16=78,Mapping!BE69,BF69)","v":0},null,null,null,null,null,null,null,null,null,null,null,null,null,null,null,null,null,null,null,null,null,null,null,null,null,null,null,null,null,null,null,null,null,null,null,null,null,null,null,null,null,null,null,null,null,null,null,null,null,null,null,null,null,null,null,null,null,null,null,null,null,null,null,null,null,null,null,null,null,null,null,null,null,null,null,null,null,null,null,null,null,null,null,null,null,null,null,null,null,null,null,null,null,null,null,null,null,null,null,null,null,null,null,null,null,null,null,null,null,null,null,null,null,null,null,null,null,null,null,null,null,null,null,null,null,null,null,null,null,null,null,null,null,null,null,"Antaba Medos Madrid kwadratowa skośna + klamka Warszawa","Inox"]
["DB 200",20,20,"x","x",20,28,36,36,null,null,null,null,null,null,null,null,null,null,null,null,null,null,null,"RAL 3005",500,"RAL 3005",{"$f":"IF((VLOOKUP(Wycena!$C$7,Mapping!$Q$15:$R$20,2,0))=\"tak\",\"\",AA70)","v":"RAL 3005"},{"$f":"IF(ROWS($AB$3:AB70)>(ROWS($AB$3:$AB$229)-COUNTBLANK($AB$3:$AB$229)),\"\",INDEX($AB$3:$AB$229,SMALL(IF($AB$3:$AB$229<>\"\",ROW($AB$3:$AB$229)-2),ROWS($AB$3:AB70))))","v":{"$error":"#N/A"}},null,null,null,null,null,null,null,null,null,null,null,null,null,null,null,null,null,null,null,null,139,1,1,{"$f":"IF(Wycena!$C$16=78,Mapping!AY70,AZ70)","v":1},null,null,247,0,0,{"$f":"IF(Wycena!$C$16=78,Mapping!BE70,BF70)","v":0},null,null,null,null,null,null,null,null,null,null,null,null,null,null,null,null,null,null,null,null,null,null,null,null,null,null,null,null,null,null,null,null,null,null,null,null,null,null,null,null,null,null,null,null,null,null,null,null,null,null,null,null,null,null,null,null,null,null,null,null,null,null,null,null,null,null,null,null,null,null,null,null,null,null,null,null,null,null,null,null,null,null,null,null,null,null,null,null,null,null,null,null,null,null,null,null,null,null,null,null,null,null,null,null,null,null,null,null,null,null,null,null,null,null,null,null,null,null,null,null,null,null,null,null,null,null,null,null,null,null,null,null,null,null,null,"Antaba Medos Madrid kwadratowa skośna + klamka Warszawa","Stare złoto"]
["DB 200a",20,20,"x","x",20,28,36,36,null,null,null,null,null,null,null,null,null,null,null,null,null,null,null,"RAL 3007",500,"RAL 3007",{"$f":"IF((VLOOKUP(Wycena!$C$7,Mapping!$Q$15:$R$20,2,0))=\"tak\",\"\",AA71)","v":"RAL 3007"},{"$f":"IF(ROWS($AB$3:AB71)>(ROWS($AB$3:$AB$229)-COUNTBLANK($AB$3:$AB$229)),\"\",INDEX($AB$3:$AB$229,SMALL(IF($AB$3:$AB$229<>\"\",ROW($AB$3:$AB$229)-2),ROWS($AB$3:AB71))))","v":{"$error":"#N/A"}},null,null,null,null,null,null,null,null,null,null,null,null,null,null,null,null,null,null,null,null,140,1,1,{"$f":"IF(Wycena!$C$16=78,Mapping!AY71,AZ71)","v":1},null,null,248,0,0,{"$f":"IF(Wycena!$C$16=78,Mapping!BE71,BF71)","v":0},null,null,null,null,null,null,null,null,null,null,null,null,null,null,null,null,null,null,null,null,null,null,null,null,null,null,null,null,null,null,null,null,null,null,null,null,null,null,null,null,null,null,null,null,null,null,null,null,null,null,null,null,null,null,null,null,null,null,null,null,null,null,null,null,null,null,null,null,null,null,null,null,null,null,null,null,null,null,null,null,null,null,null,null,null,null,null,null,null,null,null,null,null,null,null,null,null,null,null,null,null,null,null,null,null,null,null,null,null,null,null,null,null,null,null,null,null,null,null,null,null,null,null,null,null,null,null,null,null,null,null,null,null,null,null,"Antaba Medos Madrid kwadratowa skośna + klamka Warszawa","Czarny"]
["DB 202a",20,20,"x","x",20,48,48,48,null,null,null,null,null,null,null,null,null,null,null,null,null,null,null,"RAL 3009",500,"RAL 3009",{"$f":"IF((VLOOKUP(Wycena!$C$7,Mapping!$Q$15:$R$20,2,0))=\"tak\",\"\",AA72)","v":"RAL 3009"},{"$f":"IF(ROWS($AB$3:AB72)>(ROWS($AB$3:$AB$229)-COUNTBLANK($AB$3:$AB$229)),\"\",INDEX($AB$3:$AB$229,SMALL(IF($AB$3:$AB$229<>\"\",ROW($AB$3:$AB$229)-2),ROWS($AB$3:AB72))))","v":{"$error":"#N/A"}},null,null,null,null,null,null,null,null,null,null,null,null,null,null,null,null,null,null,null,null,141,1,1,{"$f":"IF(Wycena!$C$16=78,Mapping!AY72,AZ72)","v":1},null,null,249,0,0,{"$f":"IF(Wycena!$C$16=78,Mapping!BE72,BF72)","v":0},null,null,null,null,null,null,null,null,null,null,null,null,null,null,null,null,null,null,null,null,null,null,null,null,null,null,null,null,null,null,null,null,null,null,null,null,null,null,null,null,null,null,null,null,null,null,null,null,null,null,null,null,null,null,null,null,null,null,null,null,null,null,null,null,null,null,null,null,null,null,null,null,null,null,null,null,null,null,null,null,null,null,null,null,null,null,null,null,null,null,null,null,null,null,null,null,null,null,null,null,null,null,null,null,null,null,null,null,null,null,null,null,null,null,null,null,null,null,null,null,null,null,null,null,null,null,null,null,null,null,null,null,null,null,null,"Antaba Medos Paris okrągła prosta + klamka Warszawa","Inox"]
["DB 203a",20,20,"x","x",20,28,36,36,null,null,null,null,null,null,null,null,null,null,null,null,null,null,null,"RAL 3011",500,"RAL 3011",{"$f":"IF((VLOOKUP(Wycena!$C$7,Mapping!$Q$15:$R$20,2,0))=\"tak\",\"\",AA73)","v":"RAL 3011"},{"$f":"IF(ROWS($AB$3:AB73)>(ROWS($AB$3:$AB$229)-COUNTBLANK($AB$3:$AB$229)),\"\",INDEX($AB$3:$AB$229,SMALL(IF($AB$3:$AB$229<>\"\",ROW($AB$3:$AB$229)-2),ROWS($AB$3:AB73))))","v":{"$error":"#N/A"}},null,null,null,null,null,null,null,null,null,null,null,null,null,null,null,null,null,null,null,null,142,1,1,{"$f":"IF(Wycena!$C$16=78,Mapping!AY73,AZ73)","v":1},null,null,250,0,0,{"$f":"IF(Wycena!$C$16=78,Mapping!BE73,BF73)","v":0},null,null,null,null,null,null,null,null,null,null,null,null,null,null,null,null,null,null,null,null,null,null,null,null,null,null,null,null,null,null,null,null,null,null,null,null,null,null,null,null,null,null,null,null,null,null,null,null,null,null,null,null,null,null,null,null,null,null,null,null,null,null,null,null,null,null,null,null,null,null,null,null,null,null,null,null,null,null,null,null,null,null,null,null,null,null,null,null,null,null,null,null,null,null,null,null,null,null,null,null,null,null,null,null,null,null,null,null,null,null,null,null,null,null,null,null,null,null,null,null,null,null,null,null,null,null,null,null,null,null,null,null,null,null,null,"Antaba Medos Paris okrągła prosta + klamka Warszawa","Stare złoto"]
["DB 204",20,20,"x","x",20,48,48,48,null,null,null,null,null,null,null,null,null,null,null,null,null,null,null,"RAL 3012",500,"RAL 3012",{"$f":"IF((VLOOKUP(Wycena!$C$7,Mapping!$Q$15:$R$20,2,0))=\"tak\",\"\",AA74)","v":"RAL 3012"},{"$f":"IF(ROWS($AB$3:AB74)>(ROWS($AB$3:$AB$229)-COUNTBLANK($AB$3:$AB$229)),\"\",INDEX($AB$3:$AB$229,SMALL(IF($AB$3:$AB$229<>\"\",ROW($AB$3:$AB$229)-2),ROWS($AB$3:AB74))))","v":{"$error":"#N/A"}},null,null,null,null,null,null,null,null,null,null,null,null,null,null,null,null,null,null,null,null,143,1,1,{"$f":"IF(Wycena!$C$16=78,Mapping!AY74,AZ74)","v":1},null,null,251,1,0,{"$f":"IF(Wycena!$C$16=78,Mapping!BE74,BF74)","v":0},null,null,null,null,null,null,null,null,null,null,null,null,null,null,null,null,null,null,null,null,null,null,null,null,null,null,null,null,null,null,null,null,null,null,null,null,null,null,null,null,null,null,null,null,null,null,null,null,null,null,null,null,null,null,null,null,null,null,null,null,null,null,null,null,null,null,null,null,null,null,null,null,null,null,null,null,null,null,null,null,null,null,null,null,null,null,null,null,null,null,null,null,null,null,null,null,null,null,null,null,null,null,null,null,null,null,null,null,null,null,null,null,null,null,null,null,null,null,null,null,null,null,null,null,null,null,null,null,null,null,null,null,null,null,null,"Antaba Medos Paris okrągła prosta + klamka Warszawa","Czarny"]
["DB 204a",20,20,"x","x",20,48,48,48,null,null,null,null,null,null,null,null,null,null,null,null,null,null,null,"RAL 3013",500,"RAL 3013",{"$f":"IF((VLOOKUP(Wycena!$C$7,Mapping!$Q$15:$R$20,2,0))=\"tak\",\"\",AA75)","v":"RAL 3013"},{"$f":"IF(ROWS($AB$3:AB75)>(ROWS($AB$3:$AB$229)-COUNTBLANK($AB$3:$AB$229)),\"\",INDEX($AB$3:$AB$229,SMALL(IF($AB$3:$AB$229<>\"\",ROW($AB$3:$AB$229)-2),ROWS($AB$3:AB75))))","v":{"$error":"#N/A"}},null,null,null,null,null,null,null,null,null,null,null,null,null,null,null,null,null,null,null,null,144,1,1,{"$f":"IF(Wycena!$C$16=78,Mapping!AY75,AZ75)","v":1},null,null,252,1,0,{"$f":"IF(Wycena!$C$16=78,Mapping!BE75,BF75)","v":0},null,null,null,null,null,null,null,null,null,null,null,null,null,null,null,null,null,null,null,null,null,null,null,null,null,null,null,null,null,null,null,null,null,null,null,null,null,null,null,null,null,null,null,null,null,null,null,null,null,null,null,null,null,null,null,null,null,null,null,null,null,null,null,null,null,null,null,null,null,null,null,null,null,null,null,null,null,null,null,null,null,null,null,null,null,null,null,null,null,null,null,null,null,null,null,null,null,null,null,null,null,null,null,null,null,null,null,null,null,null,null,null,null,null,null,null,null,null,null,null,null,null,null,null,null,null,null,null,null,null,null,null,null,null,null,"Antaba Medos Paris okrągła prosta + klamka Warszawa","Inox"]
["DB 205a",20,20,"x","x",20,28,36,36,null,null,null,null,null,null,null,null,null,null,null,null,null,null,null,"RAL 3014",500,"RAL 3014",{"$f":"IF((VLOOKUP(Wycena!$C$7,Mapping!$Q$15:$R$20,2,0))=\"tak\",\"\",AA76)","v":"RAL 3014"},{"$f":"IF(ROWS($AB$3:AB76)>(ROWS($AB$3:$AB$229)-COUNTBLANK($AB$3:$AB$229)),\"\",INDEX($AB$3:$AB$229,SMALL(IF($AB$3:$AB$229<>\"\",ROW($AB$3:$AB$229)-2),ROWS($AB$3:AB76))))","v":{"$error":"#N/A"}},null,null,null,null,null,null,null,null,null,null,null,null,null,null,null,null,null,null,null,null,145,1,1,{"$f":"IF(Wycena!$C$16=78,Mapping!AY76,AZ76)","v":1},null,null,253,1,1,{"$f":"IF(Wycena!$C$16=78,Mapping!BE76,BF76)","v":1},null,null,null,null,null,null,null,null,null,null,null,null,null,null,null,null,null,null,null,null,null,null,null,null,null,null,null,null,null,null,null,null,null,null,null,null,null,null,null,null,null,null,null,null,null,null,null,null,null,null,null,null,null,null,null,null,null,null,null,null,null,null,null,null,null,null,null,null,null,null,null,null,null,null,null,null,null,null,null,null,null,null,null,null,null,null,null,null,null,null,null,null,null,null,null,null,null,null,null,null,null,null,null,null,null,null,null,null,null,null,null,null,null,null,null,null,null,null,null,null,null,null,null,null,null,null,null,null,null,null,null,null,null,null,null,"Antaba Medos Paris okrągła prosta + klamka Warszawa","Stare złoto"]
["DB 206a",20,20,"x","x",20,28,36,36,null,null,null,null,null,null,null,null,null,null,null,null,null,null,null,"RAL 3015",500,"RAL 3015",{"$f":"IF((VLOOKUP(Wycena!$C$7,Mapping!$Q$15:$R$20,2,0))=\"tak\",\"\",AA77)","v":"RAL 3015"},{"$f":"IF(ROWS($AB$3:AB77)>(ROWS($AB$3:$AB$229)-COUNTBLANK($AB$3:$AB$229)),\"\",INDEX($AB$3:$AB$229,SMALL(IF($AB$3:$AB$229<>\"\",ROW($AB$3:$AB$229)-2),ROWS($AB$3:AB77))))","v":{"$error":"#N/A"}},null,null,null,null,null,null,null,null,null,null,null,null,null,null,null,null,null,null,null,null,146,1,1,{"$f":"IF(Wycena!$C$16=78,Mapping!AY77,AZ77)","v":1},null,null,254,1,1,{"$f":"IF(Wycena!$C$16=78,Mapping!BE77,BF77)","v":1},null,null,null,null,null,null,null,null,null,null,null,null,null,null,null,null,null,null,null,null,null,null,null,null,null,null,null,null,null,null,null,null,null,null,null,null,null,null,null,null,null,null,null,null,null,null,null,null,null,null,null,null,null,null,null,null,null,null,null,null,null,null,null,null,null,null,null,null,null,null,null,null,null,null,null,null,null,null,null,null,null,null,null,null,null,null,null,null,null,null,null,null,null,null,null,null,null,null,null,null,null,null,null,null,null,null,null,null,null,null,null,null,null,null,null,null,null,null,null,null,null,null,null,null,null,null,null,null,null,null,null,null,null,null,null,"Antaba Medos Paris okrągła prosta + klamka Warszawa","Czarny"]
["DB 207",20,20,"x","x",20,28,36,36,null,null,null,null,null,null,null,null,null,null,null,null,null,null,null,"RAL 3016",500,"RAL 3016",{"$f":"IF((VLOOKUP(Wycena!$C$7,Mapping!$Q$15:$R$20,2,0))=\"tak\",\"\",AA78)","v":"RAL 3016"},{"$f":"IF(ROWS($AB$3:AB78)>(ROWS($AB$3:$AB$229)-COUNTBLANK($AB$3:$AB$229)),\"\",INDEX($AB$3:$AB$229,SMALL(IF($AB$3:$AB$229<>\"\",ROW($AB$3:$AB$229)-2),ROWS($AB$3:AB78))))","v":{"$error":"#N/A"}},null,null,null,null,null,null,null,null,null,null,null,null,null,null,null,null,null,null,null,null,147,1,1,{"$f":"IF(Wycena!$C$16=78,Mapping!AY78,AZ78)","v":1},null,null,255,1,1,{"$f":"IF(Wycena!$C$16=78,Mapping!BE78,BF78)","v":1},null,null,null,null,null,null,null,null,null,null,null,null,null,null,null,null,null,null,null,null,null,null,null,null,null,null,null,null,null,null,null,null,null,null,null,null,null,null,null,null,null,null,null,null,null,null,null,null,null,null,null,null,null,null,null,null,null,null,null,null,null,null,null,null,null,null,null,null,null,null,null,null,null,null,null,null,null,null,null,null,null,null,null,null,null,null,null,null,null,null,null,null,null,null,null,null,null,null,null,null,null,null,null,null,null,null,null,null,null,null,null,null,null,null,null,null,null,null,null,null,null,null,null,null,null,null,null,null,null,null,null,null,null,null,null,"Antaba Medos Paris okrągła skośna + klamka Warszawa","Inox"]
["DB 207a",20,20,"x","x",20,48,48,48,null,null,null,null,null,null,null,null,null,null,null,null,null,null,null,"RAL 3017",500,"RAL 3017",{"$f":"IF((VLOOKUP(Wycena!$C$7,Mapping!$Q$15:$R$20,2,0))=\"tak\",\"\",AA79)","v":"RAL 3017"},{"$f":"IF(ROWS($AB$3:AB79)>(ROWS($AB$3:$AB$229)-COUNTBLANK($AB$3:$AB$229)),\"\",INDEX($AB$3:$AB$229,SMALL(IF($AB$3:$AB$229<>\"\",ROW($AB$3:$AB$229)-2),ROWS($AB$3:AB79))))","v":{"$error":"#N/A"}},null,null,null,null,null,null,null,null,null,null,null,null,null,null,null,null,null,null,null,null,148,1,1,{"$f":"IF(Wycena!$C$16=78,Mapping!AY79,AZ79)","v":1},null,null,256,1,1,{"$f":"IF(Wycena!$C$16=78,Mapping!BE79,BF79)","v":1},null,null,null,null,null,null,null,null,null,null,null,null,null,null,null,null,null,null,null,null,null,null,null,null,null,null,null,null,null,null,null,null,null,null,null,null,null,null,null,null,null,null,null,null,null,null,null,null,null,null,null,null,null,null,null,null,null,null,null,null,null,null,null,null,null,null,null,null,null,null,null,null,null,null,null,null,null,null,null,null,null,null,null,null,null,null,null,null,null,null,null,null,null,null,null,null,null,null,null,null,null,null,null,null,null,null,null,null,null,null,null,null,null,null,null,null,null,null,null,null,null,null,null,null,null,null,null,null,null,null,null,null,null,null,null,"Antaba Medos Paris okrągła skośna + klamka Warszawa","Stare złoto"]
["DB 208a",20,20,"x","x",20,48,48,48,null,null,null,null,null,null,null,null,null,null,null,null,null,null,null,"RAL 3018",500,"RAL 3018",{"$f":"IF((VLOOKUP(Wycena!$C$7,Mapping!$Q$15:$R$20,2,0))=\"tak\",\"\",AA80)","v":"RAL 3018"},{"$f":"IF(ROWS($AB$3:AB80)>(ROWS($AB$3:$AB$229)-COUNTBLANK($AB$3:$AB$229)),\"\",INDEX($AB$3:$AB$229,SMALL(IF($AB$3:$AB$229<>\"\",ROW($AB$3:$AB$229)-2),ROWS($AB$3:AB80))))","v":{"$error":"#N/A"}},null,null,null,null,null,null,null,null,null,null,null,null,null,null,null,null,null,null,null,null,149,1,1,{"$f":"IF(Wycena!$C$16=78,Mapping!AY80,AZ80)","v":1},null,null,257,1,1,{"$f":"IF(Wycena!$C$16=78,Mapping!BE80,BF80)","v":1},null,null,null,null,null,null,null,null,null,null,null,null,null,null,null,null,null,null,null,null,null,null,null,null,null,null,null,null,null,null,null,null,null,null,null,null,null,null,null,null,null,null,null,null,null,null,null,null,null,null,null,null,null,null,null,null,null,null,null,null,null,null,null,null,null,null,null,null,null,null,null,null,null,null,null,null,null,null,null,null,null,null,null,null,null,null,null,null,null,null,null,null,null,null,null,null,null,null,null,null,null,null,null,null,null,null,null,null,null,null,null,null,null,null,null,null,null,null,null,null,null,null,null,null,null,null,null,null,null,null,null,null,null,null,null,"Antaba Medos Paris okrągła skośna + klamka Warszawa","Czarny"]
["DB 209a",20,20,"x","x",20,42,42,42,null,null,null,null,null,null,null,null,null,null,null,null,null,null,null,"RAL 3020",500,"RAL 3020",{"$f":"IF((VLOOKUP(Wycena!$C$7,Mapping!$Q$15:$R$20,2,0))=\"tak\",\"\",AA81)","v":"RAL 3020"},{"$f":"IF(ROWS($AB$3:AB81)>(ROWS($AB$3:$AB$229)-COUNTBLANK($AB$3:$AB$229)),\"\",INDEX($AB$3:$AB$229,SMALL(IF($AB$3:$AB$229<>\"\",ROW($AB$3:$AB$229)-2),ROWS($AB$3:AB81))))","v":{"$error":"#N/A"}},null,null,null,null,null,null,null,null,null,null,null,null,null,null,null,null,null,null,null,null,150,1,1,{"$f":"IF(Wycena!$C$16=78,Mapping!AY81,AZ81)","v":1},null,null,258,1,1,{"$f":"IF(Wycena!$C$16=78,Mapping!BE81,BF81)","v":1},null,null,null,null,null,null,null,null,null,null,null,null,null,null,null,null,null,null,null,null,null,null,null,null,null,null,null,null,null,null,null,null,null,null,null,null,null,null,null,null,null,null,null,null,null,null,null,null,null,null,null,null,null,null,null,null,null,null,null,null,null,null,null,null,null,null,null,null,null,null,null,null,null,null,null,null,null,null,null,null,null,null,null,null,null,null,null,null,null,null,null,null,null,null,null,null,null,null,null,null,null,null,null,null,null,null,null,null,null,null,null,null,null,null,null,null,null,null,null,null,null,null,null,null,null,null,null,null,null,null,null,null,null,null,null,"Antaba łukowa okrągła prosta + klamka Warszawa","Stal nierdzewna"]
["DB 210a",20,20,"x","x",20,28,36,36,null,null,null,null,null,null,null,null,null,null,null,null,null,null,null,"RAL 3022",500,"RAL 3022",{"$f":"IF((VLOOKUP(Wycena!$C$7,Mapping!$Q$15:$R$20,2,0))=\"tak\",\"\",AA82)","v":"RAL 3022"},{"$f":"IF(ROWS($AB$3:AB82)>(ROWS($AB$3:$AB$229)-COUNTBLANK($AB$3:$AB$229)),\"\",INDEX($AB$3:$AB$229,SMALL(IF($AB$3:$AB$229<>\"\",ROW($AB$3:$AB$229)-2),ROWS($AB$3:AB82))))","v":{"$error":"#N/A"}},null,null,null,null,null,null,null,null,null,null,null,null,null,null,null,null,null,null,null,null,151,1,1,{"$f":"IF(Wycena!$C$16=78,Mapping!AY82,AZ82)","v":1},null,null,259,1,1,{"$f":"IF(Wycena!$C$16=78,Mapping!BE82,BF82)","v":1},null,null,null,null,null,null,null,null,null,null,null,null,null,null,null,null,null,null,null,null,null,null,null,null,null,null,null,null,null,null,null,null,null,null,null,null,null,null,null,null,null,null,null,null,null,null,null,null,null,null,null,null,null,null,null,null,null,null,null,null,null,null,null,null,null,null,null,null,null,null,null,null,null,null,null,null,null,null,null,null,null,null,null,null,null,null,null,null,null,null,null,null,null,null,null,null,null,null,null,null,null,null,null,null,null,null,null,null,null,null,null,null,null,null,null,null,null,null,null,null,null,null,null,null,null,null,null,null,null,null,null,null,null,null,null,"Antaba łukowa prostokątna prosta + klamka Warszawa","Stal nierdzewna"]
["DB 211",20,20,"x","x",20,50,50,50,null,null,null,null,null,null,null,null,null,null,null,null,null,null,null,"RAL 3024",500,"RAL 3024",{"$f":"IF((VLOOKUP(Wycena!$C$7,Mapping!$Q$15:$R$20,2,0))=\"tak\",\"\",AA83)","v":"RAL 3024"},{"$f":"IF(ROWS($AB$3:AB83)>(ROWS($AB$3:$AB$229)-COUNTBLANK($AB$3:$AB$229)),\"\",INDEX($AB$3:$AB$229,SMALL(IF($AB$3:$AB$229<>\"\",ROW($AB$3:$AB$229)-2),ROWS($AB$3:AB83))))","v":{"$error":"#N/A"}},null,null,null,null,null,null,null,null,null,null,null,null,null,null,null,null,null,null,null,null,152,1,1,{"$f":"IF(Wycena!$C$16=78,Mapping!AY83,AZ83)","v":1},null,null,260,1,1,{"$f":"IF(Wycena!$C$16=78,Mapping!BE83,BF83)","v":1},null,null,null,null,null,null,null,null,null,null,null,null,null,null,null,null,null,null,null,null,null,null,null,null,null,null,null,null,null,null,null,null,null,null,null,null,null,null,null,null,null,null,null,null,null,null,null,null,null,null,null,null,null,null,null,null,null,null,null,null,null,null,null,null,null,null,null,null,null,null,null,null,null,null,null,null,null,null,null,null,null,null,null,null,null,null,null,null,null,null,null,null,null,null,null,null,null,null,null,null,null,null,null,null,null,null,null,null,null,null,null,null,null,null,null,null,null,null,null,null,null,null,null,null,null,null,null,null,null,null,null,null,null,null,null,"Antaba AXA Amsterdam prostokątna prosta + klamka Gaja ","Inox"]
["DB 211a",20,20,"x","x",20,42,42,42,null,null,null,null,null,null,null,null,null,null,null,null,null,null,null,"RAL 3026",500,"RAL 3026",{"$f":"IF((VLOOKUP(Wycena!$C$7,Mapping!$Q$15:$R$20,2,0))=\"tak\",\"\",AA84)","v":"RAL 3026"},{"$f":"IF(ROWS($AB$3:AB84)>(ROWS($AB$3:$AB$229)-COUNTBLANK($AB$3:$AB$229)),\"\",INDEX($AB$3:$AB$229,SMALL(IF($AB$3:$AB$229<>\"\",ROW($AB$3:$AB$229)-2),ROWS($AB$3:AB84))))","v":{"$error":"#N/A"}},null,null,null,null,null,null,null,null,null,null,null,null,null,null,null,null,null,null,null,null,153,1,1,{"$f":"IF(Wycena!$C$16=78,Mapping!AY84,AZ84)","v":1},null,null,261,1,1,{"$f":"IF(Wycena!$C$16=78,Mapping!BE84,BF84)","v":1},null,null,null,null,null,null,null,null,null,null,null,null,null,null,null,null,null,null,null,null,null,null,null,null,null,null,null,null,null,null,null,null,null,null,null,null,null,null,null,null,null,null,null,null,null,null,null,null,null,null,null,null,null,null,null,null,null,null,null,null,null,null,null,null,null,null,null,null,null,null,null,null,null,null,null,null,null,null,null,null,null,null,null,null,null,null,null,null,null,null,null,null,null,null,null,null,null,null,null,null,null,null,null,null,null,null,null,null,null,null,null,null,null,null,null,null,null,null,null,null,null,null,null,null,null,null,null,null,null,null,null,null,null,null,null,"Antaba AXA Amsterdam prostokątna prosta + klamka Gaja ","Tytan"]
["DB 212a",20,20,"x","x",20,28,36,36,null,null,null,null,null,null,null,null,null,null,null,null,null,null,null,"RAL 3027",500,"RAL 3027",{"$f":"IF((VLOOKUP(Wycena!$C$7,Mapping!$Q$15:$R$20,2,0))=\"tak\",\"\",AA85)","v":"RAL 3027"},{"$f":"IF(ROWS($AB$3:AB85)>(ROWS($AB$3:$AB$229)-COUNTBLANK($AB$3:$AB$229)),\"\",INDEX($AB$3:$AB$229,SMALL(IF($AB$3:$AB$229<>\"\",ROW($AB$3:$AB$229)-2),ROWS($AB$3:AB85))))","v":{"$error":"#N/A"}},null,null,null,null,null,null,null,null,null,null,null,null,null,null,null,null,null,null,null,null,154,1,1,{"$f":"IF(Wycena!$C$16=78,Mapping!AY85,AZ85)","v":1},null,null,262,1,1,{"$f":"IF(Wycena!$C$16=78,Mapping!BE85,BF85)","v":1},null,null,null,null,null,null,null,null,null,null,null,null,null,null,null,null,null,null,null,null,null,null,null,null,null,null,null,null,null,null,null,null,null,null,null,null,null,null,null,null,null,null,null,null,null,null,null,null,null,null,null,null,null,null,null,null,null,null,null,null,null,null,null,null,null,null,null,null,null,null,null,null,null,null,null,null,null,null,null,null,null,null,null,null,null,null,null,null,null,null,null,null,null,null,null,null,null,null,null,null,null,null,null,null,null,null,null,null,null,null,null,null,null,null,null,null,null,null,null,null,null,null,null,null,null,null,null,null,null,null,null,null,null,null,null,"Antaba AXA Amsterdam prostokątna prosta + klamka Gaja ","Stare złoto"]
["DB 213a",20,20,"x","x",20,42,42,42,null,null,null,null,null,null,null,null,null,null,null,null,null,null,null,"RAL 3028",500,"RAL 3028",{"$f":"IF((VLOOKUP(Wycena!$C$7,Mapping!$Q$15:$R$20,2,0))=\"tak\",\"\",AA86)","v":"RAL 3028"},{"$f":"IF(ROWS($AB$3:AB86)>(ROWS($AB$3:$AB$229)-COUNTBLANK($AB$3:$AB$229)),\"\",INDEX($AB$3:$AB$229,SMALL(IF($AB$3:$AB$229<>\"\",ROW($AB$3:$AB$229)-2),ROWS($AB$3:AB86))))","v":{"$error":"#N/A"}},null,null,null,null,null,null,null,null,null,null,null,null,null,null,null,null,null,null,null,null,155,1,1,{"$f":"IF(Wycena!$C$16=78,Mapping!AY86,AZ86)","v":1},null,null,263,1,1,{"$f":"IF(Wycena!$C$16=78,Mapping!BE86,BF86)","v":1},null,null,null,null,null,null,null,null,null,null,null,null,null,null,null,null,null,null,null,null,null,null,null,null,null,null,null,null,null,null,null,null,null,null,null,null,null,null,null,null,null,null,null,null,null,null,null,null,null,null,null,null,null,null,null,null,null,null,null,null,null,null,null,null,null,null,null,null,null,null,null,null,null,null,null,null,null,null,null,null,null,null,null,null,null,null,null,null,null,null,null,null,null,null,null,null,null,null,null,null,null,null,null,null,null,null,null,null,null,null,null,null,null,null,null,null,null,null,null,null,null,null,null,null,null,null,null,null,null,null,null,null,null,null,null,"Antaba AXA Amsterdam prostokątna prosta + klamka Gaja ","Czarny"]
["DB 214",20,20,"x","x",20,28,36,36,null,null,null,null,null,null,null,null,null,null,null,null,null,null,null,"RAL 3031",500,"RAL 3031",{"$f":"IF((VLOOKUP(Wycena!$C$7,Mapping!$Q$15:$R$20,2,0))=\"tak\",\"\",AA87)","v":"RAL 3031"},{"$f":"IF(ROWS($AB$3:AB87)>(ROWS($AB$3:$AB$229)-COUNTBLANK($AB$3:$AB$229)),\"\",INDEX($AB$3:$AB$229,SMALL(IF($AB$3:$AB$229<>\"\",ROW($AB$3:$AB$229)-2),ROWS($AB$3:AB87))))","v":{"$error":"#N/A"}},null,null,null,null,null,null,null,null,null,null,null,null,null,null,null,null,null,null,null,null,156,1,1,{"$f":"IF(Wycena!$C$16=78,Mapping!AY87,AZ87)","v":1},null,null,264,1,1,{"$f":"IF(Wycena!$C$16=78,Mapping!BE87,BF87)","v":1},null,null,null,null,null,null,null,null,null,null,null,null,null,null,null,null,null,null,null,null,null,null,null,null,null,null,null,null,null,null,null,null,null,null,null,null,null,null,null,null,null,null,null,null,null,null,null,null,null,null,null,null,null,null,null,null,null,null,null,null,null,null,null,null,null,null,null,null,null,null,null,null,null,null,null,null,null,null,null,null,null,null,null,null,null,null,null,null,null,null,null,null,null,null,null,null,null,null,null,null,null,null,null,null,null,null,null,null,null,null,null,null,null,null,null,null,null,null,null,null,null,null,null,null,null,null,null,null,null,null,null,null,null,null,null,"Antaba AXA Amsterdam prostokątna skośna + klamka Gaja ","Inox"]
["DB 215",20,20,"x","x",20,28,36,36,null,null,null,null,null,null,null,null,null,null,null,null,null,null,null,"RAL 3032",500,"RAL 3032",{"$f":"IF((VLOOKUP(Wycena!$C$7,Mapping!$Q$15:$R$20,2,0))=\"tak\",\"\",AA88)","v":"RAL 3032"},{"$f":"IF(ROWS($AB$3:AB88)>(ROWS($AB$3:$AB$229)-COUNTBLANK($AB$3:$AB$229)),\"\",INDEX($AB$3:$AB$229,SMALL(IF($AB$3:$AB$229<>\"\",ROW($AB$3:$AB$229)-2),ROWS($AB$3:AB88))))","v":{"$error":"#N/A"}},null,null,null,null,null,null,null,null,null,null,null,null,null,null,null,null,null,null,null,null,157,1,1,{"$f":"IF(Wycena!$C$16=78,Mapping!AY88,AZ88)","v":1},null,null,265,1,1,{"$f":"IF(Wycena!$C$16=78,Mapping!BE88,BF88)","v":1},null,null,null,null,null,null,null,null,null,null,null,null,null,null,null,null,null,null,null,null,null,null,null,null,null,null,null,null,null,null,null,null,null,null,null,null,null,null,null,null,null,null,null,null,null,null,null,null,null,null,null,null,null,null,null,null,null,null,null,null,null,null,null,null,null,null,null,null,null,null,null,null,null,null,null,null,null,null,null,null,null,null,null,null,null,null,null,null,null,null,null,null,null,null,null,null,null,null,null,null,null,null,null,null,null,null,null,null,null,null,null,null,null,null,null,null,null,null,null,null,null,null,null,null,null,null,null,null,null,null,null,null,null,null,null,"Antaba AXA Amsterdam prostokątna skośna + klamka Gaja ","Tytan"]
["DB 216",20,20,"x","x",20,28,36,36,null,null,null,null,null,null,null,null,null,null,null,null,null,null,null,"RAL 3033",500,"RAL 3033",{"$f":"IF((VLOOKUP(Wycena!$C$7,Mapping!$Q$15:$R$20,2,0))=\"tak\",\"\",AA89)","v":"RAL 3033"},{"$f":"IF(ROWS($AB$3:AB89)>(ROWS($AB$3:$AB$229)-COUNTBLANK($AB$3:$AB$229)),\"\",INDEX($AB$3:$AB$229,SMALL(IF($AB$3:$AB$229<>\"\",ROW($AB$3:$AB$229)-2),ROWS($AB$3:AB89))))","v":{"$error":"#N/A"}},null,null,null,null,null,null,null,null,null,null,null,null,null,null,null,null,null,null,null,null,158,1,1,{"$f":"IF(Wycena!$C$16=78,Mapping!AY89,AZ89)","v":1},null,null,266,1,1,{"$f":"IF(Wycena!$C$16=78,Mapping!BE89,BF89)","v":1},null,null,null,null,null,null,null,null,null,null,null,null,null,null,null,null,null,null,null,null,null,null,null,null,null,null,null,null,null,null,null,null,null,null,null,null,null,null,null,null,null,null,null,null,null,null,null,null,null,null,null,null,null,null,null,null,null,null,null,null,null,null,null,null,null,null,null,null,null,null,null,null,null,null,null,null,null,null,null,null,null,null,null,null,null,null,null,null,null,null,null,null,null,null,null,null,null,null,null,null,null,null,null,null,null,null,null,null,null,null,null,null,null,null,null,null,null,null,null,null,null,null,null,null,null,null,null,null,null,null,null,null,null,null,null,"Antaba AXA Amsterdam prostokątna skośna + klamka Gaja ","Stare złoto"]
["DB 217",20,20,"x","x",20,28,36,36,null,null,null,null,null,null,null,null,null,null,null,null,null,null,null,"RAL 4001",500,"RAL 4001",{"$f":"IF((VLOOKUP(Wycena!$C$7,Mapping!$Q$15:$R$20,2,0))=\"tak\",\"\",AA90)","v":"RAL 4001"},{"$f":"IF(ROWS($AB$3:AB90)>(ROWS($AB$3:$AB$229)-COUNTBLANK($AB$3:$AB$229)),\"\",INDEX($AB$3:$AB$229,SMALL(IF($AB$3:$AB$229<>\"\",ROW($AB$3:$AB$229)-2),ROWS($AB$3:AB90))))","v":{"$error":"#N/A"}},null,null,null,null,null,null,null,null,null,null,null,null,null,null,null,null,null,null,null,null,159,1,1,{"$f":"IF(Wycena!$C$16=78,Mapping!AY90,AZ90)","v":1},null,null,267,1,1,{"$f":"IF(Wycena!$C$16=78,Mapping!BE90,BF90)","v":1},null,null,null,null,null,null,null,null,null,null,null,null,null,null,null,null,null,null,null,null,null,null,null,null,null,null,null,null,null,null,null,null,null,null,null,null,null,null,null,null,null,null,null,null,null,null,null,null,null,null,null,null,null,null,null,null,null,null,null,null,null,null,null,null,null,null,null,null,null,null,null,null,null,null,null,null,null,null,null,null,null,null,null,null,null,null,null,null,null,null,null,null,null,null,null,null,null,null,null,null,null,null,null,null,null,null,null,null,null,null,null,null,null,null,null,null,null,null,null,null,null,null,null,null,null,null,null,null,null,null,null,null,null,null,null,"Antaba AXA Amsterdam prostokątna skośna + klamka Gaja ","Czarny"]
["DB 218",20,20,"x","x",20,28,36,36,null,null,null,null,null,null,null,null,null,null,null,null,null,null,null,"RAL 4002",500,"RAL 4002",{"$f":"IF((VLOOKUP(Wycena!$C$7,Mapping!$Q$15:$R$20,2,0))=\"tak\",\"\",AA91)","v":"RAL 4002"},{"$f":"IF(ROWS($AB$3:AB91)>(ROWS($AB$3:$AB$229)-COUNTBLANK($AB$3:$AB$229)),\"\",INDEX($AB$3:$AB$229,SMALL(IF($AB$3:$AB$229<>\"\",ROW($AB$3:$AB$229)-2),ROWS($AB$3:AB91))))","v":{"$error":"#N/A"}},null,null,null,null,null,null,null,null,null,null,null,null,null,null,null,null,null,null,null,null,160,1,1,{"$f":"IF(Wycena!$C$16=78,Mapping!AY91,AZ91)","v":1},null,null,268,1,1,{"$f":"IF(Wycena!$C$16=78,Mapping!BE91,BF91)","v":1},null,null,null,null,null,null,null,null,null,null,null,null,null,null,null,null,null,null,null,null,null,null,null,null,null,null,null,null,null,null,null,null,null,null,null,null,null,null,null,null,null,null,null,null,null,null,null,null,null,null,null,null,null,null,null,null,null,null,null,null,null,null,null,null,null,null,null,null,null,null,null,null,null,null,null,null,null,null,null,null,null,null,null,null,null,null,null,null,null,null,null,null,null,null,null,null,null,null,null,null,null,null,null,null,null,null,null,null,null,null,null,null,null,null,null,null,null,null,null,null,null,null,null,null,null,null,null,null,null,null,null,null,null,null,null,"Antaba AXA Montreal okrągła prosta + klamka Gaja ","Inox"]
["DB 219",20,20,"x","x",20,28,36,36,null,null,null,null,null,null,null,null,null,null,null,null,null,null,null,"RAL 4003",500,"RAL 4003",{"$f":"IF((VLOOKUP(Wycena!$C$7,Mapping!$Q$15:$R$20,2,0))=\"tak\",\"\",AA92)","v":"RAL 4003"},{"$f":"IF(ROWS($AB$3:AB92)>(ROWS($AB$3:$AB$229)-COUNTBLANK($AB$3:$AB$229)),\"\",INDEX($AB$3:$AB$229,SMALL(IF($AB$3:$AB$229<>\"\",ROW($AB$3:$AB$229)-2),ROWS($AB$3:AB92))))","v":{"$error":"#N/A"}},null,null,null,null,null,null,null,null,null,null,null,null,null,null,null,null,null,null,null,null,161,1,1,{"$f":"IF(Wycena!$C$16=78,Mapping!AY92,AZ92)","v":1},null,null,269,1,1,{"$f":"IF(Wycena!$C$16=78,Mapping!BE92,BF92)","v":1},null,null,null,null,null,null,null,null,null,null,null,null,null,null,null,null,null,null,null,null,null,null,null,null,null,null,null,null,null,null,null,null,null,null,null,null,null,null,null,null,null,null,null,null,null,null,null,null,null,null,null,null,null,null,null,null,null,null,null,null,null,null,null,null,null,null,null,null,null,null,null,null,null,null,null,null,null,null,null,null,null,null,null,null,null,null,null,null,null,null,null,null,null,null,null,null,null,null,null,null,null,null,null,null,null,null,null,null,null,null,null,null,null,null,null,null,null,null,null,null,null,null,null,null,null,null,null,null,null,null,null,null,null,null,null,"Antaba AXA Montreal okrągła prosta + klamka Gaja ","Tytan"]
["DB 221",20,20,"x","x",20,28,36,36,null,null,null,null,null,null,null,null,null,null,null,null,null,null,null,"RAL 4004",500,"RAL 4004",{"$f":"IF((VLOOKUP(Wycena!$C$7,Mapping!$Q$15:$R$20,2,0))=\"tak\",\"\",AA93)","v":"RAL 4004"},{"$f":"IF(ROWS($AB$3:AB93)>(ROWS($AB$3:$AB$229)-COUNTBLANK($AB$3:$AB$229)),\"\",INDEX($AB$3:$AB$229,SMALL(IF($AB$3:$AB$229<>\"\",ROW($AB$3:$AB$229)-2),ROWS($AB$3:AB93))))","v":{"$error":"#N/A"}},null,null,null,null,null,null,null,null,null,null,null,null,null,null,null,null,null,null,null,null,162,1,1,{"$f":"IF(Wycena!$C$16=78,Mapping!AY93,AZ93)","v":1},null,null,270,1,1,{"$f":"IF(Wycena!$C$16=78,Mapping!BE93,BF93)","v":1},null,null,null,null,null,null,null,null,null,null,null,null,null,null,null,null,null,null,null,null,null,null,null,null,null,null,null,null,null,null,null,null,null,null,null,null,null,null,null,null,null,null,null,null,null,null,null,null,null,null,null,null,null,null,null,null,null,null,null,null,null,null,null,null,null,null,null,null,null,null,null,null,null,null,null,null,null,null,null,null,null,null,null,null,null,null,null,null,null,null,null,null,null,null,null,null,null,null,null,null,null,null,null,null,null,null,null,null,null,null,null,null,null,null,null,null,null,null,null,null,null,null,null,null,null,null,null,null,null,null,null,null,null,null,null,"Antaba AXA Montreal okrągła prosta + klamka Gaja ","Stare złoto"]
["DB 223",20,20,"x","x",20,42,42,42,null,null,null,null,null,null,null,null,null,null,null,null,null,null,null,"RAL 4005",500,"RAL 4005",{"$f":"IF((VLOOKUP(Wycena!$C$7,Mapping!$Q$15:$R$20,2,0))=\"tak\",\"\",AA94)","v":"RAL 4005"},{"$f":"IF(ROWS($AB$3:AB94)>(ROWS($AB$3:$AB$229)-COUNTBLANK($AB$3:$AB$229)),\"\",INDEX($AB$3:$AB$229,SMALL(IF($AB$3:$AB$229<>\"\",ROW($AB$3:$AB$229)-2),ROWS($AB$3:AB94))))","v":{"$error":"#N/A"}},null,null,null,null,null,null,null,null,null,null,null,null,null,null,null,null,null,null,null,null,163,1,1,{"$f":"IF(Wycena!$C$16=78,Mapping!AY94,AZ94)","v":1},null,null,271,1,1,{"$f":"IF(Wycena!$C$16=78,Mapping!BE94,BF94)","v":1},null,null,null,null,null,null,null,null,null,null,null,null,null,null,null,null,null,null,null,null,null,null,null,null,null,null,null,null,null,null,null,null,null,null,null,null,null,null,null,null,null,null,null,null,null,null,null,null,null,null,null,null,null,null,null,null,null,null,null,null,null,null,null,null,null,null,null,null,null,null,null,null,null,null,null,null,null,null,null,null,null,null,null,null,null,null,null,null,null,null,null,null,null,null,null,null,null,null,null,null,null,null,null,null,null,null,null,null,null,null,null,null,null,null,null,null,null,null,null,null,null,null,null,null,null,null,null,null,null,null,null,null,null,null,null,"Antaba AXA Montreal okrągła prosta + klamka Gaja ","Czarny"]
["DB 224",20,20,"x","x",20,28,36,36,null,null,null,null,null,null,null,null,null,null,null,null,null,null,null,"RAL 4006",500,"RAL 4006",{"$f":"IF((VLOOKUP(Wycena!$C$7,Mapping!$Q$15:$R$20,2,0))=\"tak\",\"\",AA95)","v":"RAL 4006"},{"$f":"IF(ROWS($AB$3:AB95)>(ROWS($AB$3:$AB$229)-COUNTBLANK($AB$3:$AB$229)),\"\",INDEX($AB$3:$AB$229,SMALL(IF($AB$3:$AB$229<>\"\",ROW($AB$3:$AB$229)-2),ROWS($AB$3:AB95))))","v":{"$error":"#N/A"}},null,null,null,null,null,null,null,null,null,null,null,null,null,null,null,null,null,null,null,null,164,1,1,{"$f":"IF(Wycena!$C$16=78,Mapping!AY95,AZ95)","v":1},null,null,272,1,1,{"$f":"IF(Wycena!$C$16=78,Mapping!BE95,BF95)","v":1},null,null,null,null,null,null,null,null,null,null,null,null,null,null,null,null,null,null,null,null,null,null,null,null,null,null,null,null,null,null,null,null,null,null,null,null,null,null,null,null,null,null,null,null,null,null,null,null,null,null,null,null,null,null,null,null,null,null,null,null,null,null,null,null,null,null,null,null,null,null,null,null,null,null,null,null,null,null,null,null,null,null,null,null,null,null,null,null,null,null,null,null,null,null,null,null,null,null,null,null,null,null,null,null,null,null,null,null,null,null,null,null,null,null,null,null,null,null,null,null,null,null,null,null,null,null,null,null,null,null,null,null,null,null,null,"Antaba AXA Montreal okrągła skośna + klamka Gaja ","Inox"]
["DB 225",20,20,"x","x",20,28,36,36,null,null,null,null,null,null,null,null,null,null,null,null,null,null,null,"RAL 4007",500,"RAL 4007",{"$f":"IF((VLOOKUP(Wycena!$C$7,Mapping!$Q$15:$R$20,2,0))=\"tak\",\"\",AA96)","v":"RAL 4007"},{"$f":"IF(ROWS($AB$3:AB96)>(ROWS($AB$3:$AB$229)-COUNTBLANK($AB$3:$AB$229)),\"\",INDEX($AB$3:$AB$229,SMALL(IF($AB$3:$AB$229<>\"\",ROW($AB$3:$AB$229)-2),ROWS($AB$3:AB96))))","v":{"$error":"#N/A"}},null,null,null,null,null,null,null,null,null,null,null,null,null,null,null,null,null,null,null,null,165,1,1,{"$f":"IF(Wycena!$C$16=78,Mapping!AY96,AZ96)","v":1},null,null,273,1,1,{"$f":"IF(Wycena!$C$16=78,Mapping!BE96,BF96)","v":1},null,null,null,null,null,null,null,null,null,null,null,null,null,null,null,null,null,null,null,null,null,null,null,null,null,null,null,null,null,null,null,null,null,null,null,null,null,null,null,null,null,null,null,null,null,null,null,null,null,null,null,null,null,null,null,null,null,null,null,null,null,null,null,null,null,null,null,null,null,null,null,null,null,null,null,null,null,null,null,null,null,null,null,null,null,null,null,null,null,null,null,null,null,null,null,null,null,null,null,null,null,null,null,null,null,null,null,null,null,null,null,null,null,null,null,null,null,null,null,null,null,null,null,null,null,null,null,null,null,null,null,null,null,null,null,"Antaba AXA Montreal okrągła skośna + klamka Gaja ","Tytan"]
["DB 226",20,20,"x","x",20,28,36,36,null,null,null,null,null,null,null,null,null,null,null,null,null,null,null,"RAL 4008",500,"RAL 4008",{"$f":"IF((VLOOKUP(Wycena!$C$7,Mapping!$Q$15:$R$20,2,0))=\"tak\",\"\",AA97)","v":"RAL 4008"},{"$f":"IF(ROWS($AB$3:AB97)>(ROWS($AB$3:$AB$229)-COUNTBLANK($AB$3:$AB$229)),\"\",INDEX($AB$3:$AB$229,SMALL(IF($AB$3:$AB$229<>\"\",ROW($AB$3:$AB$229)-2),ROWS($AB$3:AB97))))","v":{"$error":"#N/A"}},null,null,null,null,null,null,null,null,null,null,null,null,null,null,null,null,null,null,null,null,166,1,1,{"$f":"IF(Wycena!$C$16=78,Mapping!AY97,AZ97)","v":1},null,null,274,1,1,{"$f":"IF(Wycena!$C$16=78,Mapping!BE97,BF97)","v":1},null,null,null,null,null,null,null,null,null,null,null,null,null,null,null,null,null,null,null,null,null,null,null,null,null,null,null,null,null,null,null,null,null,null,null,null,null,null,null,null,null,null,null,null,null,null,null,null,null,null,null,null,null,null,null,null,null,null,null,null,null,null,null,null,null,null,null,null,null,null,null,null,null,null,null,null,null,null,null,null,null,null,null,null,null,null,null,null,null,null,null,null,null,null,null,null,null,null,null,null,null,null,null,null,null,null,null,null,null,null,null,null,null,null,null,null,null,null,null,null,null,null,null,null,null,null,null,null,null,null,null,null,null,null,null,"Antaba AXA Montreal okrągła skośna + klamka Gaja ","Stare złoto"]
["DB 249",20,20,"x","x",20,28,36,36,null,null,null,null,null,null,null,null,null,null,null,null,null,null,null,"RAL 4009",500,"RAL 4009",{"$f":"IF((VLOOKUP(Wycena!$C$7,Mapping!$Q$15:$R$20,2,0))=\"tak\",\"\",AA98)","v":"RAL 4009"},{"$f":"IF(ROWS($AB$3:AB98)>(ROWS($AB$3:$AB$229)-COUNTBLANK($AB$3:$AB$229)),\"\",INDEX($AB$3:$AB$229,SMALL(IF($AB$3:$AB$229<>\"\",ROW($AB$3:$AB$229)-2),ROWS($AB$3:AB98))))","v":{"$error":"#N/A"}},null,null,null,null,null,null,null,null,null,null,null,null,null,null,null,null,null,null,null,null,167,1,1,{"$f":"IF(Wycena!$C$16=78,Mapping!AY98,AZ98)","v":1},null,null,275,1,1,{"$f":"IF(Wycena!$C$16=78,Mapping!BE98,BF98)","v":1},null,null,null,null,null,null,null,null,null,null,null,null,null,null,null,null,null,null,null,null,null,null,null,null,null,null,null,null,null,null,null,null,null,null,null,null,null,null,null,null,null,null,null,null,null,null,null,null,null,null,null,null,null,null,null,null,null,null,null,null,null,null,null,null,null,null,null,null,null,null,null,null,null,null,null,null,null,null,null,null,null,null,null,null,null,null,null,null,null,null,null,null,null,null,null,null,null,null,null,null,null,null,null,null,null,null,null,null,null,null,null,null,null,null,null,null,null,null,null,null,null,null,null,null,null,null,null,null,null,null,null,null,null,null,null,"Antaba AXA Montreal okrągła skośna + klamka Gaja ","Czarny"]
["DB 250",20,20,"x","x",20,28,36,36,null,null,null,null,null,null,null,null,null,null,null,null,null,null,null,"RAL 4010",500,"RAL 4010",{"$f":"IF((VLOOKUP(Wycena!$C$7,Mapping!$Q$15:$R$20,2,0))=\"tak\",\"\",AA99)","v":"RAL 4010"},{"$f":"IF(ROWS($AB$3:AB99)>(ROWS($AB$3:$AB$229)-COUNTBLANK($AB$3:$AB$229)),\"\",INDEX($AB$3:$AB$229,SMALL(IF($AB$3:$AB$229<>\"\",ROW($AB$3:$AB$229)-2),ROWS($AB$3:AB99))))","v":{"$error":"#N/A"}},null,null,null,null,null,null,null,null,null,null,null,null,null,null,null,null,null,null,null,null,168,1,1,{"$f":"IF(Wycena!$C$16=78,Mapping!AY99,AZ99)","v":1},null,null,276,1,1,{"$f":"IF(Wycena!$C$16=78,Mapping!BE99,BF99)","v":1},null,null,null,null,null,null,null,null,null,null,null,null,null,null,null,null,null,null,null,null,null,null,null,null,null,null,null,null,null,null,null,null,null,null,null,null,null,null,null,null,null,null,null,null,null,null,null,null,null,null,null,null,null,null,null,null,null,null,null,null,null,null,null,null,null,null,null,null,null,null,null,null,null,null,null,null,null,null,null,null,null,null,null,null,null,null,null,null,null,null,null,null,null,null,null,null,null,null,null,null,null,null,null,null,null,null,null,null,null,null,null,null,null,null,null,null,null,null,null,null,null,null,null,null,null,null,null,null,null,null,null,null,null,null,null,"Antaba Vegas prostokątna polerowana + klamka Warszawa","Inox"]
["DB 251",20,20,"x","x",20,28,36,36,null,null,null,null,null,null,null,null,null,null,null,null,null,null,null,"RAL 4011",500,"RAL 4011",{"$f":"IF((VLOOKUP(Wycena!$C$7,Mapping!$Q$15:$R$20,2,0))=\"tak\",\"\",AA100)","v":"RAL 4011"},{"$f":"IF(ROWS($AB$3:AB100)>(ROWS($AB$3:$AB$229)-COUNTBLANK($AB$3:$AB$229)),\"\",INDEX($AB$3:$AB$229,SMALL(IF($AB$3:$AB$229<>\"\",ROW($AB$3:$AB$229)-2),ROWS($AB$3:AB100))))","v":{"$error":"#N/A"}},null,null,null,null,null,null,null,null,null,null,null,null,null,null,null,null,null,null,null,null,169,1,1,{"$f":"IF(Wycena!$C$16=78,Mapping!AY100,AZ100)","v":1},null,null,277,1,1,{"$f":"IF(Wycena!$C$16=78,Mapping!BE100,BF100)","v":1}]
["DB 252",20,20,"x","x",20,28,36,36,null,null,null,null,null,null,null,null,null,null,null,null,null,null,null,"RAL 4012",500,"RAL 4012",{"$f":"IF((VLOOKUP(Wycena!$C$7,Mapping!$Q$15:$R$20,2,0))=\"tak\",\"\",AA101)","v":"RAL 4012"},{"$f":"IF(ROWS($AB$3:AB101)>(ROWS($AB$3:$AB$229)-COUNTBLANK($AB$3:$AB$229)),\"\",INDEX($AB$3:$AB$229,SMALL(IF($AB$3:$AB$229<>\"\",ROW($AB$3:$AB$229)-2),ROWS($AB$3:AB101))))","v":{"$error":"#N/A"}},null,null,null,null,null,null,null,null,null,null,null,null,null,null,null,null,null,null,null,null,170,1,1,{"$f":"IF(Wycena!$C$16=78,Mapping!AY101,AZ101)","v":1},null,null,278,1,1,{"$f":"IF(Wycena!$C$16=78,Mapping!BE101,BF101)","v":1}]
["DB 253",20,20,"x","x",20,28,36,36,null,null,null,null,null,null,null,null,null,null,null,null,null,null,null,"RAL 5000",500,"RAL 5000",{"$f":"IF((VLOOKUP(Wycena!$C$7,Mapping!$Q$15:$R$20,2,0))=\"tak\",\"\",AA102)","v":"RAL 5000"},{"$f":"IF(ROWS($AB$3:AB102)>(ROWS($AB$3:$AB$229)-COUNTBLANK($AB$3:$AB$229)),\"\",INDEX($AB$3:$AB$229,SMALL(IF($AB$3:$AB$229<>\"\",ROW($AB$3:$AB$229)-2),ROWS($AB$3:AB102))))","v":{"$error":"#N/A"}},null,null,null,null,null,null,null,null,null,null,null,null,null,null,null,null,null,null,null,null,171,1,1,{"$f":"IF(Wycena!$C$16=78,Mapping!AY102,AZ102)","v":1},null,null,279,1,1,{"$f":"IF(Wycena!$C$16=78,Mapping!BE102,BF102)","v":1}]
["DB 253a",20,20,"x","x",20,28,36,36,null,null,null,null,null,null,null,null,null,null,null,null,null,null,null,"RAL 5001",500,"RAL 5001",{"$f":"IF((VLOOKUP(Wycena!$C$7,Mapping!$Q$15:$R$20,2,0))=\"tak\",\"\",AA103)","v":"RAL 5001"},{"$f":"IF(ROWS($AB$3:AB103)>(ROWS($AB$3:$AB$229)-COUNTBLANK($AB$3:$AB$229)),\"\",INDEX($AB$3:$AB$229,SMALL(IF($AB$3:$AB$229<>\"\",ROW($AB$3:$AB$229)-2),ROWS($AB$3:AB103))))","v":{"$error":"#N/A"}},null,null,null,null,null,null,null,null,null,null,null,null,null,null,null,null,null,null,null,null,172,1,1,{"$f":"IF(Wycena!$C$16=78,Mapping!AY103,AZ103)","v":1},null,null,280,1,1,{"$f":"IF(Wycena!$C$16=78,Mapping!BE103,BF103)","v":1}]
["DB 253b",20,20,"x","x",20,28,36,36,null,null,null,null,null,null,null,null,null,null,null,null,null,null,null,"RAL 5002",500,"RAL 5002",{"$f":"IF((VLOOKUP(Wycena!$C$7,Mapping!$Q$15:$R$20,2,0))=\"tak\",\"\",AA104)","v":"RAL 5002"},{"$f":"IF(ROWS($AB$3:AB104)>(ROWS($AB$3:$AB$229)-COUNTBLANK($AB$3:$AB$229)),\"\",INDEX($AB$3:$AB$229,SMALL(IF($AB$3:$AB$229<>\"\",ROW($AB$3:$AB$229)-2),ROWS($AB$3:AB104))))","v":{"$error":"#N/A"}},null,null,null,null,null,null,null,null,null,null,null,null,null,null,null,null,null,null,null,null,173,1,1,{"$f":"IF(Wycena!$C$16=78,Mapping!AY104,AZ104)","v":1},null,null,281,1,1,{"$f":"IF(Wycena!$C$16=78,Mapping!BE104,BF104)","v":1}]
["DB 265",20,20,"x","x",20,28,36,36,null,null,null,null,null,null,null,null,null,null,null,null,null,null,null,"RAL 5003",500,"RAL 5003",{"$f":"IF((VLOOKUP(Wycena!$C$7,Mapping!$Q$15:$R$20,2,0))=\"tak\",\"\",AA105)","v":"RAL 5003"},{"$f":"IF(ROWS($AB$3:AB105)>(ROWS($AB$3:$AB$229)-COUNTBLANK($AB$3:$AB$229)),\"\",INDEX($AB$3:$AB$229,SMALL(IF($AB$3:$AB$229<>\"\",ROW($AB$3:$AB$229)-2),ROWS($AB$3:AB105))))","v":{"$error":"#N/A"}},null,null,null,null,null,null,null,null,null,null,null,null,null,null,null,null,null,null,null,null,174,1,1,{"$f":"IF(Wycena!$C$16=78,Mapping!AY105,AZ105)","v":1},null,null,282,1,1,{"$f":"IF(Wycena!$C$16=78,Mapping!BE105,BF105)","v":1}]
["DB 266",20,20,"x","x",20,48,58,58,null,null,null,null,null,null,null,null,null,null,null,null,null,null,null,"RAL 5004",500,"RAL 5004",{"$f":"IF((VLOOKUP(Wycena!$C$7,Mapping!$Q$15:$R$20,2,0))=\"tak\",\"\",AA106)","v":"RAL 5004"},{"$f":"IF(ROWS($AB$3:AB106)>(ROWS($AB$3:$AB$229)-COUNTBLANK($AB$3:$AB$229)),\"\",INDEX($AB$3:$AB$229,SMALL(IF($AB$3:$AB$229<>\"\",ROW($AB$3:$AB$229)-2),ROWS($AB$3:AB106))))","v":{"$error":"#N/A"}},null,null,null,null,null,null,null,null,null,null,null,null,null,null,null,null,null,null,null,null,175,1,1,{"$f":"IF(Wycena!$C$16=78,Mapping!AY106,AZ106)","v":1},null,null,283,1,1,{"$f":"IF(Wycena!$C$16=78,Mapping!BE106,BF106)","v":1}]
["DB 273",20,20,"x","x",20,28,36,36,null,null,null,null,null,null,null,null,null,null,null,null,null,null,null,"RAL 5005",500,"RAL 5005",{"$f":"IF((VLOOKUP(Wycena!$C$7,Mapping!$Q$15:$R$20,2,0))=\"tak\",\"\",AA107)","v":"RAL 5005"},{"$f":"IF(ROWS($AB$3:AB107)>(ROWS($AB$3:$AB$229)-COUNTBLANK($AB$3:$AB$229)),\"\",INDEX($AB$3:$AB$229,SMALL(IF($AB$3:$AB$229<>\"\",ROW($AB$3:$AB$229)-2),ROWS($AB$3:AB107))))","v":{"$error":"#N/A"}},null,null,null,null,null,null,null,null,null,null,null,null,null,null,null,null,null,null,null,null,176,1,1,{"$f":"IF(Wycena!$C$16=78,Mapping!AY107,AZ107)","v":1},null,null,284,1,1,{"$f":"IF(Wycena!$C$16=78,Mapping!BE107,BF107)","v":1}]
["DB 274",20,20,"x","x",20,28,36,36,null,null,null,null,null,null,null,null,null,null,null,null,null,null,null,"RAL 5007",500,"RAL 5007",{"$f":"IF((VLOOKUP(Wycena!$C$7,Mapping!$Q$15:$R$20,2,0))=\"tak\",\"\",AA108)","v":"RAL 5007"},{"$f":"IF(ROWS($AB$3:AB108)>(ROWS($AB$3:$AB$229)-COUNTBLANK($AB$3:$AB$229)),\"\",INDEX($AB$3:$AB$229,SMALL(IF($AB$3:$AB$229<>\"\",ROW($AB$3:$AB$229)-2),ROWS($AB$3:AB108))))","v":{"$error":"#N/A"}},null,null,null,null,null,null,null,null,null,null,null,null,null,null,null,null,null,null,null,null,177,1,1,{"$f":"IF(Wycena!$C$16=78,Mapping!AY108,AZ108)","v":1},null,null,285,1,1,{"$f":"IF(Wycena!$C$16=78,Mapping!BE108,BF108)","v":1}]
["DB 278",20,20,"x","x",20,28,36,36,null,null,null,null,null,null,null,null,null,null,null,null,null,null,null,"RAL 5008",500,"RAL 5008",{"$f":"IF((VLOOKUP(Wycena!$C$7,Mapping!$Q$15:$R$20,2,0))=\"tak\",\"\",AA109)","v":"RAL 5008"},{"$f":"IF(ROWS($AB$3:AB109)>(ROWS($AB$3:$AB$229)-COUNTBLANK($AB$3:$AB$229)),\"\",INDEX($AB$3:$AB$229,SMALL(IF($AB$3:$AB$229<>\"\",ROW($AB$3:$AB$229)-2),ROWS($AB$3:AB109))))","v":{"$error":"#N/A"}},null,null,null,null,null,null,null,null,null,null,null,null,null,null,null,null,null,null,null,null,178,1,1,{"$f":"IF(Wycena!$C$16=78,Mapping!AY109,AZ109)","v":1},null,null,286,1,1,{"$f":"IF(Wycena!$C$16=78,Mapping!BE109,BF109)","v":1}]
["DB 279",20,20,"x","x",20,28,36,36,null,null,null,null,null,null,null,null,null,null,null,null,null,null,null,"RAL 5009",500,"RAL 5009",{"$f":"IF((VLOOKUP(Wycena!$C$7,Mapping!$Q$15:$R$20,2,0))=\"tak\",\"\",AA110)","v":"RAL 5009"},{"$f":"IF(ROWS($AB$3:AB110)>(ROWS($AB$3:$AB$229)-COUNTBLANK($AB$3:$AB$229)),\"\",INDEX($AB$3:$AB$229,SMALL(IF($AB$3:$AB$229<>\"\",ROW($AB$3:$AB$229)-2),ROWS($AB$3:AB110))))","v":{"$error":"#N/A"}},null,null,null,null,null,null,null,null,null,null,null,null,null,null,null,null,null,null,null,null,179,1,1,{"$f":"IF(Wycena!$C$16=78,Mapping!AY110,AZ110)","v":1},null,null,287,1,1,{"$f":"IF(Wycena!$C$16=78,Mapping!BE110,BF110)","v":1}]
["DB 279a",20,20,"x","x",20,38,46,46,null,null,null,null,null,null,null,null,null,null,null,null,null,null,null,"RAL 5010",500,"RAL 5010",{"$f":"IF((VLOOKUP(Wycena!$C$7,Mapping!$Q$15:$R$20,2,0))=\"tak\",\"\",AA111)","v":"RAL 5010"},{"$f":"IF(ROWS($AB$3:AB111)>(ROWS($AB$3:$AB$229)-COUNTBLANK($AB$3:$AB$229)),\"\",INDEX($AB$3:$AB$229,SMALL(IF($AB$3:$AB$229<>\"\",ROW($AB$3:$AB$229)-2),ROWS($AB$3:AB111))))","v":{"$error":"#N/A"}},null,null,null,null,null,null,null,null,null,null,null,null,null,null,null,null,null,null,null,null,180,1,1,{"$f":"IF(Wycena!$C$16=78,Mapping!AY111,AZ111)","v":1},null,null,288,1,1,{"$f":"IF(Wycena!$C$16=78,Mapping!BE111,BF111)","v":1}]
["DB 285",20,20,"x","x",20,48,58,58,null,null,null,null,null,null,null,null,null,null,null,null,null,null,null,"RAL 5011",500,"RAL 5011",{"$f":"IF((VLOOKUP(Wycena!$C$7,Mapping!$Q$15:$R$20,2,0))=\"tak\",\"\",AA112)","v":"RAL 5011"},{"$f":"IF(ROWS($AB$3:AB112)>(ROWS($AB$3:$AB$229)-COUNTBLANK($AB$3:$AB$229)),\"\",INDEX($AB$3:$AB$229,SMALL(IF($AB$3:$AB$229<>\"\",ROW($AB$3:$AB$229)-2),ROWS($AB$3:AB112))))","v":{"$error":"#N/A"}},null,null,null,null,null,null,null,null,null,null,null,null,null,null,null,null,null,null,null,null,181,1,1,{"$f":"IF(Wycena!$C$16=78,Mapping!AY112,AZ112)","v":1},null,null,289,1,1,{"$f":"IF(Wycena!$C$16=78,Mapping!BE112,BF112)","v":1}]
["DB 286",20,20,"x","x",20,28,36,36,null,null,null,null,null,null,null,null,null,null,null,null,null,null,null,"RAL 5012",500,"RAL 5012",{"$f":"IF((VLOOKUP(Wycena!$C$7,Mapping!$Q$15:$R$20,2,0))=\"tak\",\"\",AA113)","v":"RAL 5012"},{"$f":"IF(ROWS($AB$3:AB113)>(ROWS($AB$3:$AB$229)-COUNTBLANK($AB$3:$AB$229)),\"\",INDEX($AB$3:$AB$229,SMALL(IF($AB$3:$AB$229<>\"\",ROW($AB$3:$AB$229)-2),ROWS($AB$3:AB113))))","v":{"$error":"#N/A"}},null,null,null,null,null,null,null,null,null,null,null,null,null,null,null,null,null,null,null,null,182,1,1,{"$f":"IF(Wycena!$C$16=78,Mapping!AY113,AZ113)","v":1},null,null,290,1,1,{"$f":"IF(Wycena!$C$16=78,Mapping!BE113,BF113)","v":1}]
["DB 289",20,20,"x","x",20,28,36,36,null,null,null,null,null,null,null,null,null,null,null,null,null,null,null,"RAL 5013",500,"RAL 5013",{"$f":"IF((VLOOKUP(Wycena!$C$7,Mapping!$Q$15:$R$20,2,0))=\"tak\",\"\",AA114)","v":"RAL 5013"},{"$f":"IF(ROWS($AB$3:AB114)>(ROWS($AB$3:$AB$229)-COUNTBLANK($AB$3:$AB$229)),\"\",INDEX($AB$3:$AB$229,SMALL(IF($AB$3:$AB$229<>\"\",ROW($AB$3:$AB$229)-2),ROWS($AB$3:AB114))))","v":{"$error":"#N/A"}},null,null,null,null,null,null,null,null,null,null,null,null,null,null,null,null,null,null,null,null,183,1,1,{"$f":"IF(Wycena!$C$16=78,Mapping!AY114,AZ114)","v":1},null,null,291,1,1,{"$f":"IF(Wycena!$C$16=78,Mapping!BE114,BF114)","v":1}]
["DB 290",20,20,"x","x",20,28,36,36,null,null,null,null,null,null,null,null,null,null,null,null,null,null,null,"RAL 5014",500,"RAL 5014",{"$f":"IF((VLOOKUP(Wycena!$C$7,Mapping!$Q$15:$R$20,2,0))=\"tak\",\"\",AA115)","v":"RAL 5014"},{"$f":"IF(ROWS($AB$3:AB115)>(ROWS($AB$3:$AB$229)-COUNTBLANK($AB$3:$AB$229)),\"\",INDEX($AB$3:$AB$229,SMALL(IF($AB$3:$AB$229<>\"\",ROW($AB$3:$AB$229)-2),ROWS($AB$3:AB115))))","v":{"$error":"#N/A"}},null,null,null,null,null,null,null,null,null,null,null,null,null,null,null,null,null,null,null,null,184,1,1,{"$f":"IF(Wycena!$C$16=78,Mapping!AY115,AZ115)","v":1},null,null,292,1,1,{"$f":"IF(Wycena!$C$16=78,Mapping!BE115,BF115)","v":1}]
["DB 291",20,20,"x","x",20,28,36,36,null,null,null,null,null,null,null,null,null,null,null,null,null,null,null,"RAL 5015",500,"RAL 5015",{"$f":"IF((VLOOKUP(Wycena!$C$7,Mapping!$Q$15:$R$20,2,0))=\"tak\",\"\",AA116)","v":"RAL 5015"},{"$f":"IF(ROWS($AB$3:AB116)>(ROWS($AB$3:$AB$229)-COUNTBLANK($AB$3:$AB$229)),\"\",INDEX($AB$3:$AB$229,SMALL(IF($AB$3:$AB$229<>\"\",ROW($AB$3:$AB$229)-2),ROWS($AB$3:AB116))))","v":{"$error":"#N/A"}},null,null,null,null,null,null,null,null,null,null,null,null,null,null,null,null,null,null,null,null,185,1,1,{"$f":"IF(Wycena!$C$16=78,Mapping!AY116,AZ116)","v":1},null,null,293,1,1,{"$f":"IF(Wycena!$C$16=78,Mapping!BE116,BF116)","v":1}]
["DB 292",20,20,"x","x",20,28,36,36,null,null,null,null,null,null,null,null,null,null,null,null,null,null,null,"RAL 5017",500,"RAL 5017",{"$f":"IF((VLOOKUP(Wycena!$C$7,Mapping!$Q$15:$R$20,2,0))=\"tak\",\"\",AA117)","v":"RAL 5017"},{"$f":"IF(ROWS($AB$3:AB117)>(ROWS($AB$3:$AB$229)-COUNTBLANK($AB$3:$AB$229)),\"\",INDEX($AB$3:$AB$229,SMALL(IF($AB$3:$AB$229<>\"\",ROW($AB$3:$AB$229)-2),ROWS($AB$3:AB117))))","v":{"$error":"#N/A"}},null,null,null,null,null,null,null,null,null,null,null,null,null,null,null,null,null,null,null,null,186,1,1,{"$f":"IF(Wycena!$C$16=78,Mapping!AY117,AZ117)","v":1},null,null,294,1,1,{"$f":"IF(Wycena!$C$16=78,Mapping!BE117,BF117)","v":1}]
["DB 293",20,20,"x","x",20,28,36,36,null,null,null,null,null,null,null,null,null,null,null,null,null,null,null,"RAL 5018",500,"RAL 5018",{"$f":"IF((VLOOKUP(Wycena!$C$7,Mapping!$Q$15:$R$20,2,0))=\"tak\",\"\",AA118)","v":"RAL 5018"},{"$f":"IF(ROWS($AB$3:AB118)>(ROWS($AB$3:$AB$229)-COUNTBLANK($AB$3:$AB$229)),\"\",INDEX($AB$3:$AB$229,SMALL(IF($AB$3:$AB$229<>\"\",ROW($AB$3:$AB$229)-2),ROWS($AB$3:AB118))))","v":{"$error":"#N/A"}},null,null,null,null,null,null,null,null,null,null,null,null,null,null,null,null,null,null,null,null,187,1,1,{"$f":"IF(Wycena!$C$16=78,Mapping!AY118,AZ118)","v":1},null,null,295,1,1,{"$f":"IF(Wycena!$C$16=78,Mapping!BE118,BF118)","v":1}]
["DB 296",20,20,"x","x",20,28,36,36,null,null,null,null,null,null,null,null,null,null,null,null,null,null,null,"RAL 5019",500,"RAL 5019",{"$f":"IF((VLOOKUP(Wycena!$C$7,Mapping!$Q$15:$R$20,2,0))=\"tak\",\"\",AA119)","v":"RAL 5019"},{"$f":"IF(ROWS($AB$3:AB119)>(ROWS($AB$3:$AB$229)-COUNTBLANK($AB$3:$AB$229)),\"\",INDEX($AB$3:$AB$229,SMALL(IF($AB$3:$AB$229<>\"\",ROW($AB$3:$AB$229)-2),ROWS($AB$3:AB119))))","v":{"$error":"#N/A"}},null,null,null,null,null,null,null,null,null,null,null,null,null,null,null,null,null,null,null,null,188,1,1,{"$f":"IF(Wycena!$C$16=78,Mapping!AY119,AZ119)","v":1},null,null,296,1,1,{"$f":"IF(Wycena!$C$16=78,Mapping!BE119,BF119)","v":1}]
["DB 297",20,20,"x","x",20,28,36,36,null,null,null,null,null,null,null,null,null,null,null,null,null,null,null,"RAL 5020",500,"RAL 5020",{"$f":"IF((VLOOKUP(Wycena!$C$7,Mapping!$Q$15:$R$20,2,0))=\"tak\",\"\",AA120)","v":"RAL 5020"},{"$f":"IF(ROWS($AB$3:AB120)>(ROWS($AB$3:$AB$229)-COUNTBLANK($AB$3:$AB$229)),\"\",INDEX($AB$3:$AB$229,SMALL(IF($AB$3:$AB$229<>\"\",ROW($AB$3:$AB$229)-2),ROWS($AB$3:AB120))))","v":{"$error":"#N/A"}},null,null,null,null,null,null,null,null,null,null,null,null,null,null,null,null,null,null,null,null,189,1,1,{"$f":"IF(Wycena!$C$16=78,Mapping!AY120,AZ120)","v":1},null,null,297,1,1,{"$f":"IF(Wycena!$C$16=78,Mapping!BE120,BF120)","v":1}]
["DB 298",20,20,"x","x",20,28,36,36,null,null,null,null,null,null,null,null,null,null,null,null,null,null,null,"RAL 5021",500,"RAL 5021",{"$f":"IF((VLOOKUP(Wycena!$C$7,Mapping!$Q$15:$R$20,2,0))=\"tak\",\"\",AA121)","v":"RAL 5021"},{"$f":"IF(ROWS($AB$3:AB121)>(ROWS($AB$3:$AB$229)-COUNTBLANK($AB$3:$AB$229)),\"\",INDEX($AB$3:$AB$229,SMALL(IF($AB$3:$AB$229<>\"\",ROW($AB$3:$AB$229)-2),ROWS($AB$3:AB121))))","v":{"$error":"#N/A"}},null,null,null,null,null,null,null,null,null,null,null,null,null,null,null,null,null,null,null,null,190,1,1,{"$f":"IF(Wycena!$C$16=78,Mapping!AY121,AZ121)","v":1},null,null,298,1,1,{"$f":"IF(Wycena!$C$16=78,Mapping!BE121,BF121)","v":1}]
["DB 299",20,20,"x","x",20,28,36,36,null,null,null,null,null,null,null,null,null,null,null,null,null,null,null,"RAL 5022",500,"RAL 5022",{"$f":"IF((VLOOKUP(Wycena!$C$7,Mapping!$Q$15:$R$20,2,0))=\"tak\",\"\",AA122)","v":"RAL 5022"},{"$f":"IF(ROWS($AB$3:AB122)>(ROWS($AB$3:$AB$229)-COUNTBLANK($AB$3:$AB$229)),\"\",INDEX($AB$3:$AB$229,SMALL(IF($AB$3:$AB$229<>\"\",ROW($AB$3:$AB$229)-2),ROWS($AB$3:AB122))))","v":{"$error":"#N/A"}},null,null,null,null,null,null,null,null,null,null,null,null,null,null,null,null,null,null,null,null,191,1,1,{"$f":"IF(Wycena!$C$16=78,Mapping!AY122,AZ122)","v":1},null,null,299,1,1,{"$f":"IF(Wycena!$C$16=78,Mapping!BE122,BF122)","v":1}]
["DB 325a",20,20,"x","x",20,36,36,36,null,null,null,null,null,null,null,null,null,null,null,null,null,null,null,"RAL 5023",500,"RAL 5023",{"$f":"IF((VLOOKUP(Wycena!$C$7,Mapping!$Q$15:$R$20,2,0))=\"tak\",\"\",AA123)","v":"RAL 5023"},{"$f":"IF(ROWS($AB$3:AB123)>(ROWS($AB$3:$AB$229)-COUNTBLANK($AB$3:$AB$229)),\"\",INDEX($AB$3:$AB$229,SMALL(IF($AB$3:$AB$229<>\"\",ROW($AB$3:$AB$229)-2),ROWS($AB$3:AB123))))","v":{"$error":"#N/A"}},null,null,null,null,null,null,null,null,null,null,null,null,null,null,null,null,null,null,null,null,192,1,1,{"$f":"IF(Wycena!$C$16=78,Mapping!AY123,AZ123)","v":1},null,null,300,1,1,{"$f":"IF(Wycena!$C$16=78,Mapping!BE123,BF123)","v":1}]
["DB 326",20,20,"x","x",20,28,36,36,null,null,null,null,null,null,null,null,null,null,null,null,null,null,null,"RAL 5024",500,"RAL 5024",{"$f":"IF((VLOOKUP(Wycena!$C$7,Mapping!$Q$15:$R$20,2,0))=\"tak\",\"\",AA124)","v":"RAL 5024"},{"$f":"IF(ROWS($AB$3:AB124)>(ROWS($AB$3:$AB$229)-COUNTBLANK($AB$3:$AB$229)),\"\",INDEX($AB$3:$AB$229,SMALL(IF($AB$3:$AB$229<>\"\",ROW($AB$3:$AB$229)-2),ROWS($AB$3:AB124))))","v":{"$error":"#N/A"}},null,null,null,null,null,null,null,null,null,null,null,null,null,null,null,null,null,null,null,null,193,1,1,{"$f":"IF(Wycena!$C$16=78,Mapping!AY124,AZ124)","v":1},null,null,301,1,1,{"$f":"IF(Wycena!$C$16=78,Mapping!BE124,BF124)","v":1}]
["DB 327",20,20,"x","x",20,28,36,36,null,null,null,null,null,null,null,null,null,null,null,null,null,null,null,"RAL 5025",500,"RAL 5025",{"$f":"IF((VLOOKUP(Wycena!$C$7,Mapping!$Q$15:$R$20,2,0))=\"tak\",\"\",AA125)","v":"RAL 5025"},{"$f":"IF(ROWS($AB$3:AB125)>(ROWS($AB$3:$AB$229)-COUNTBLANK($AB$3:$AB$229)),\"\",INDEX($AB$3:$AB$229,SMALL(IF($AB$3:$AB$229<>\"\",ROW($AB$3:$AB$229)-2),ROWS($AB$3:AB125))))","v":{"$error":"#N/A"}},null,null,null,null,null,null,null,null,null,null,null,null,null,null,null,null,null,null,null,null,194,1,1,{"$f":"IF(Wycena!$C$16=78,Mapping!AY125,AZ125)","v":1},null,null,302,1,1,{"$f":"IF(Wycena!$C$16=78,Mapping!BE125,BF125)","v":1}]
["DB 328",20,20,"x","x",20,28,36,36,null,null,null,null,null,null,null,null,null,null,null,null,null,null,null,"RAL 5026",500,"RAL 5026",{"$f":"IF((VLOOKUP(Wycena!$C$7,Mapping!$Q$15:$R$20,2,0))=\"tak\",\"\",AA126)","v":"RAL 5026"},{"$f":"IF(ROWS($AB$3:AB126)>(ROWS($AB$3:$AB$229)-COUNTBLANK($AB$3:$AB$229)),\"\",INDEX($AB$3:$AB$229,SMALL(IF($AB$3:$AB$229<>\"\",ROW($AB$3:$AB$229)-2),ROWS($AB$3:AB126))))","v":{"$error":"#N/A"}},null,null,null,null,null,null,null,null,null,null,null,null,null,null,null,null,null,null,null,null,195,1,1,{"$f":"IF(Wycena!$C$16=78,Mapping!AY126,AZ126)","v":1},null,null,303,1,1,{"$f":"IF(Wycena!$C$16=78,Mapping!BE126,BF126)","v":1}]
["DB 329",20,20,"x","x",20,28,36,36,null,null,null,null,null,null,null,null,null,null,null,null,null,null,null,"RAL 6000",500,"RAL 6000",{"$f":"IF((VLOOKUP(Wycena!$C$7,Mapping!$Q$15:$R$20,2,0))=\"tak\",\"\",AA127)","v":"RAL 6000"},{"$f":"IF(ROWS($AB$3:AB127)>(ROWS($AB$3:$AB$229)-COUNTBLANK($AB$3:$AB$229)),\"\",INDEX($AB$3:$AB$229,SMALL(IF($AB$3:$AB$229<>\"\",ROW($AB$3:$AB$229)-2),ROWS($AB$3:AB127))))","v":{"$error":"#N/A"}},null,null,null,null,null,null,null,null,null,null,null,null,null,null,null,null,null,null,null,null,196,1,1,{"$f":"IF(Wycena!$C$16=78,Mapping!AY127,AZ127)","v":1},null,null,304,1,1,{"$f":"IF(Wycena!$C$16=78,Mapping!BE127,BF127)","v":1}]
["DB 330",20,20,"x","x",20,28,36,36,null,null,null,null,null,null,null,null,null,null,null,null,null,null,null,"RAL 6001",500,"RAL 6001",{"$f":"IF((VLOOKUP(Wycena!$C$7,Mapping!$Q$15:$R$20,2,0))=\"tak\",\"\",AA128)","v":"RAL 6001"},{"$f":"IF(ROWS($AB$3:AB128)>(ROWS($AB$3:$AB$229)-COUNTBLANK($AB$3:$AB$229)),\"\",INDEX($AB$3:$AB$229,SMALL(IF($AB$3:$AB$229<>\"\",ROW($AB$3:$AB$229)-2),ROWS($AB$3:AB128))))","v":{"$error":"#N/A"}},null,null,null,null,null,null,null,null,null,null,null,null,null,null,null,null,null,null,null,null,197,1,1,{"$f":"IF(Wycena!$C$16=78,Mapping!AY128,AZ128)","v":1},null,null,305,1,1,{"$f":"IF(Wycena!$C$16=78,Mapping!BE128,BF128)","v":1}]
["DB 331",20,20,"x","x",20,36,36,36,null,null,null,null,null,null,null,null,null,null,null,null,null,null,null,"RAL 6002",500,"RAL 6002",{"$f":"IF((VLOOKUP(Wycena!$C$7,Mapping!$Q$15:$R$20,2,0))=\"tak\",\"\",AA129)","v":"RAL 6002"},{"$f":"IF(ROWS($AB$3:AB129)>(ROWS($AB$3:$AB$229)-COUNTBLANK($AB$3:$AB$229)),\"\",INDEX($AB$3:$AB$229,SMALL(IF($AB$3:$AB$229<>\"\",ROW($AB$3:$AB$229)-2),ROWS($AB$3:AB129))))","v":{"$error":"#N/A"}},null,null,null,null,null,null,null,null,null,null,null,null,null,null,null,null,null,null,null,null,198,1,1,{"$f":"IF(Wycena!$C$16=78,Mapping!AY129,AZ129)","v":1},null,null,306,1,1,{"$f":"IF(Wycena!$C$16=78,Mapping!BE129,BF129)","v":1}]
["DB 332",20,20,"x","x",20,36,36,36,null,null,null,null,null,null,null,null,null,null,null,null,null,null,null,"RAL 6003",500,"RAL 6003",{"$f":"IF((VLOOKUP(Wycena!$C$7,Mapping!$Q$15:$R$20,2,0))=\"tak\",\"\",AA130)","v":"RAL 6003"},{"$f":"IF(ROWS($AB$3:AB130)>(ROWS($AB$3:$AB$229)-COUNTBLANK($AB$3:$AB$229)),\"\",INDEX($AB$3:$AB$229,SMALL(IF($AB$3:$AB$229<>\"\",ROW($AB$3:$AB$229)-2),ROWS($AB$3:AB130))))","v":{"$error":"#N/A"}},null,null,null,null,null,null,null,null,null,null,null,null,null,null,null,null,null,null,null,null,199,1,1,{"$f":"IF(Wycena!$C$16=78,Mapping!AY130,AZ130)","v":1},null,null,307,1,1,{"$f":"IF(Wycena!$C$16=78,Mapping!BE130,BF130)","v":1}]
["DB 333",20,20,"x","x",20,28,36,36,null,null,null,null,null,null,null,null,null,null,null,null,null,null,null,"RAL 6004",500,"RAL 6004",{"$f":"IF((VLOOKUP(Wycena!$C$7,Mapping!$Q$15:$R$20,2,0))=\"tak\",\"\",AA131)","v":"RAL 6004"},{"$f":"IF(ROWS($AB$3:AB131)>(ROWS($AB$3:$AB$229)-COUNTBLANK($AB$3:$AB$229)),\"\",INDEX($AB$3:$AB$229,SMALL(IF($AB$3:$AB$229<>\"\",ROW($AB$3:$AB$229)-2),ROWS($AB$3:AB131))))","v":{"$error":"#N/A"}},null,null,null,null,null,null,null,null,null,null,null,null,null,null,null,null,null,null,null,null,200,1,1,{"$f":"IF(Wycena!$C$16=78,Mapping!AY131,AZ131)","v":1},null,null,308,1,1,{"$f":"IF(Wycena!$C$16=78,Mapping!BE131,BF131)","v":1}]
["DB 334",20,20,"x","x",20,28,36,36,null,null,null,null,null,null,null,null,null,null,null,null,null,null,null,"RAL 6005",500,"RAL 6005",{"$f":"IF((VLOOKUP(Wycena!$C$7,Mapping!$Q$15:$R$20,2,0))=\"tak\",\"\",AA132)","v":"RAL 6005"},{"$f":"IF(ROWS($AB$3:AB132)>(ROWS($AB$3:$AB$229)-COUNTBLANK($AB$3:$AB$229)),\"\",INDEX($AB$3:$AB$229,SMALL(IF($AB$3:$AB$229<>\"\",ROW($AB$3:$AB$229)-2),ROWS($AB$3:AB132))))","v":{"$error":"#N/A"}},null,null,null,null,null,null,null,null,null,null,null,null,null,null,null,null,null,null,null,null,201,1,1,{"$f":"IF(Wycena!$C$16=78,Mapping!AY132,AZ132)","v":1},null,null,309,1,1,{"$f":"IF(Wycena!$C$16=78,Mapping!BE132,BF132)","v":1}]
["DB 338",20,20,"x","x",20,36,36,36,null,null,null,null,null,null,null,null,null,null,null,null,null,null,null,"RAL 6006",500,{"$f":"Y133","v":"RAL 6006"},{"$f":"IF((VLOOKUP(Wycena!$C$7,Mapping!$Q$15:$R$20,2,0))=\"tak\",\"\",AA133)","v":"RAL 6006"},{"$f":"IF(ROWS($AB$3:AB133)>(ROWS($AB$3:$AB$229)-COUNTBLANK($AB$3:$AB$229)),\"\",INDEX($AB$3:$AB$229,SMALL(IF($AB$3:$AB$229<>\"\",ROW($AB$3:$AB$229)-2),ROWS($AB$3:AB133))))","v":{"$error":"#N/A"}},null,null,null,null,null,null,null,null,null,null,null,null,null,null,null,null,null,null,null,null,202,1,1,{"$f":"IF(Wycena!$C$16=78,Mapping!AY133,AZ133)","v":1},null,null,310,1,1,{"$f":"IF(Wycena!$C$16=78,Mapping!BE133,BF133)","v":1}]
["DB 345",20,20,"x","x",20,28,36,36,null,null,null,null,null,null,null,null,null,null,null,null,null,null,null,"RAL 6007",500,"RAL 6007",{"$f":"IF((VLOOKUP(Wycena!$C$7,Mapping!$Q$15:$R$20,2,0))=\"tak\",\"\",AA134)","v":"RAL 6007"},{"$f":"IF(ROWS($AB$3:AB134)>(ROWS($AB$3:$AB$229)-COUNTBLANK($AB$3:$AB$229)),\"\",INDEX($AB$3:$AB$229,SMALL(IF($AB$3:$AB$229<>\"\",ROW($AB$3:$AB$229)-2),ROWS($AB$3:AB134))))","v":{"$error":"#N/A"}},null,null,null,null,null,null,null,null,null,null,null,null,null,null,null,null,null,null,null,null,203,2,1,{"$f":"IF(Wycena!$C$16=78,Mapping!AY134,AZ134)","v":1},null,null,311,1,1,{"$f":"IF(Wycena!$C$16=78,Mapping!BE134,BF134)","v":1}]
["DB 350",20,20,"x","x",20,36,36,36,null,null,null,null,null,null,null,null,null,null,null,null,null,null,null,"RAL 6008",500,"RAL 6008",{"$f":"IF((VLOOKUP(Wycena!$C$7,Mapping!$Q$15:$R$20,2,0))=\"tak\",\"\",AA135)","v":"RAL 6008"},{"$f":"IF(ROWS($AB$3:AB135)>(ROWS($AB$3:$AB$229)-COUNTBLANK($AB$3:$AB$229)),\"\",INDEX($AB$3:$AB$229,SMALL(IF($AB$3:$AB$229<>\"\",ROW($AB$3:$AB$229)-2),ROWS($AB$3:AB135))))","v":{"$error":"#N/A"}},null,null,null,null,null,null,null,null,null,null,null,null,null,null,null,null,null,null,null,null,204,2,1,{"$f":"IF(Wycena!$C$16=78,Mapping!AY135,AZ135)","v":1},null,null,312,1,1,{"$f":"IF(Wycena!$C$16=78,Mapping!BE135,BF135)","v":1}]
["DB 359",20,20,"x","x",20,28,36,36,null,null,null,null,null,null,null,null,null,null,null,null,null,null,null,"RAL 6009",500,"RAL 6009",{"$f":"IF((VLOOKUP(Wycena!$C$7,Mapping!$Q$15:$R$20,2,0))=\"tak\",\"\",AA136)","v":"RAL 6009"},{"$f":"IF(ROWS($AB$3:AB136)>(ROWS($AB$3:$AB$229)-COUNTBLANK($AB$3:$AB$229)),\"\",INDEX($AB$3:$AB$229,SMALL(IF($AB$3:$AB$229<>\"\",ROW($AB$3:$AB$229)-2),ROWS($AB$3:AB136))))","v":{"$error":"#N/A"}},null,null,null,null,null,null,null,null,null,null,null,null,null,null,null,null,null,null,null,null,205,2,1,{"$f":"IF(Wycena!$C$16=78,Mapping!AY136,AZ136)","v":1},null,null,313,1,1,{"$f":"IF(Wycena!$C$16=78,Mapping!BE136,BF136)","v":1}]
["DB 360",20,20,"x","x",20,28,36,36,null,null,null,null,null,null,null,null,null,null,null,null,null,null,null,"RAL 6010",500,"RAL 6010",{"$f":"IF((VLOOKUP(Wycena!$C$7,Mapping!$Q$15:$R$20,2,0))=\"tak\",\"\",AA137)","v":"RAL 6010"},{"$f":"IF(ROWS($AB$3:AB137)>(ROWS($AB$3:$AB$229)-COUNTBLANK($AB$3:$AB$229)),\"\",INDEX($AB$3:$AB$229,SMALL(IF($AB$3:$AB$229<>\"\",ROW($AB$3:$AB$229)-2),ROWS($AB$3:AB137))))","v":{"$error":"#N/A"}},null,null,null,null,null,null,null,null,null,null,null,null,null,null,null,null,null,null,null,null,206,2,1,{"$f":"IF(Wycena!$C$16=78,Mapping!AY137,AZ137)","v":1},null,null,314,1,1,{"$f":"IF(Wycena!$C$16=78,Mapping!BE137,BF137)","v":1}]
["DB 361",20,20,"x","x",20,28,36,36,null,null,null,null,null,null,null,null,null,null,null,null,null,null,null,"RAL 6011",500,"RAL 6011",{"$f":"IF((VLOOKUP(Wycena!$C$7,Mapping!$Q$15:$R$20,2,0))=\"tak\",\"\",AA138)","v":"RAL 6011"},{"$f":"IF(ROWS($AB$3:AB138)>(ROWS($AB$3:$AB$229)-COUNTBLANK($AB$3:$AB$229)),\"\",INDEX($AB$3:$AB$229,SMALL(IF($AB$3:$AB$229<>\"\",ROW($AB$3:$AB$229)-2),ROWS($AB$3:AB138))))","v":{"$error":"#N/A"}},null,null,null,null,null,null,null,null,null,null,null,null,null,null,null,null,null,null,null,null,207,2,2,{"$f":"IF(Wycena!$C$16=78,Mapping!AY138,AZ138)","v":2},null,null,315,1,1,{"$f":"IF(Wycena!$C$16=78,Mapping!BE138,BF138)","v":1}]
["DB 363",20,20,"x","x",20,36,36,36,null,null,null,null,null,null,null,null,null,null,null,null,null,null,null,"RAL 6012",500,"RAL 6012",{"$f":"IF((VLOOKUP(Wycena!$C$7,Mapping!$Q$15:$R$20,2,0))=\"tak\",\"\",AA139)","v":"RAL 6012"},{"$f":"IF(ROWS($AB$3:AB139)>(ROWS($AB$3:$AB$229)-COUNTBLANK($AB$3:$AB$229)),\"\",INDEX($AB$3:$AB$229,SMALL(IF($AB$3:$AB$229<>\"\",ROW($AB$3:$AB$229)-2),ROWS($AB$3:AB139))))","v":{"$error":"#N/A"}},null,null,null,null,null,null,null,null,null,null,null,null,null,null,null,null,null,null,null,null,208,2,2,{"$f":"IF(Wycena!$C$16=78,Mapping!AY139,AZ139)","v":2},null,null,316,1,1,{"$f":"IF(Wycena!$C$16=78,Mapping!BE139,BF139)","v":1}]
["DB 364",20,20,"x","x",20,36,36,36,null,null,null,null,null,null,null,null,null,null,null,null,null,null,null,"RAL 6013",500,"RAL 6013",{"$f":"IF((VLOOKUP(Wycena!$C$7,Mapping!$Q$15:$R$20,2,0))=\"tak\",\"\",AA140)","v":"RAL 6013"},{"$f":"IF(ROWS($AB$3:AB140)>(ROWS($AB$3:$AB$229)-COUNTBLANK($AB$3:$AB$229)),\"\",INDEX($AB$3:$AB$229,SMALL(IF($AB$3:$AB$229<>\"\",ROW($AB$3:$AB$229)-2),ROWS($AB$3:AB140))))","v":{"$error":"#N/A"}},null,null,null,null,null,null,null,null,null,null,null,null,null,null,null,null,null,null,null,null,209,2,2,{"$f":"IF(Wycena!$C$16=78,Mapping!AY140,AZ140)","v":2},null,null,317,1,1,{"$f":"IF(Wycena!$C$16=78,Mapping!BE140,BF140)","v":1}]
["DB 366",20,20,"x","x",20,28,36,36,null,null,null,null,null,null,null,null,null,null,null,null,null,null,null,"RAL 6014",500,"RAL 6014",{"$f":"IF((VLOOKUP(Wycena!$C$7,Mapping!$Q$15:$R$20,2,0))=\"tak\",\"\",AA141)","v":"RAL 6014"},{"$f":"IF(ROWS($AB$3:AB141)>(ROWS($AB$3:$AB$229)-COUNTBLANK($AB$3:$AB$229)),\"\",INDEX($AB$3:$AB$229,SMALL(IF($AB$3:$AB$229<>\"\",ROW($AB$3:$AB$229)-2),ROWS($AB$3:AB141))))","v":{"$error":"#N/A"}},null,null,null,null,null,null,null,null,null,null,null,null,null,null,null,null,null,null,null,null,210,2,2,{"$f":"IF(Wycena!$C$16=78,Mapping!AY141,AZ141)","v":2},null,null,318,1,1,{"$f":"IF(Wycena!$C$16=78,Mapping!BE141,BF141)","v":1}]
["DB 400",20,20,"x","x",null,null,null,null,null,null,null,null,null,null,null,null,null,null,null,null,null,null,null,"RAL 6015",500,"RAL 6015",{"$f":"IF((VLOOKUP(Wycena!$C$7,Mapping!$Q$15:$R$20,2,0))=\"tak\",\"\",AA142)","v":"RAL 6015"},{"$f":"IF(ROWS($AB$3:AB142)>(ROWS($AB$3:$AB$229)-COUNTBLANK($AB$3:$AB$229)),\"\",INDEX($AB$3:$AB$229,SMALL(IF($AB$3:$AB$229<>\"\",ROW($AB$3:$AB$229)-2),ROWS($AB$3:AB142))))","v":{"$error":"#N/A"}},null,null,null,null,null,null,null,null,null,null,null,null,null,null,null,null,null,null,null,null,211,2,2,{"$f":"IF(Wycena!$C$16=78,Mapping!AY142,AZ142)","v":2},null,null,319,1,1,{"$f":"IF(Wycena!$C$16=78,Mapping!BE142,BF142)","v":1}]
["DB 405",20,20,"x","x",null,null,null,null,null,null,null,null,null,null,null,null,null,null,null,null,null,null,null,"RAL 6016",500,"RAL 6016",{"$f":"IF((VLOOKUP(Wycena!$C$7,Mapping!$Q$15:$R$20,2,0))=\"tak\",\"\",AA143)","v":"RAL 6016"},{"$f":"IF(ROWS($AB$3:AB143)>(ROWS($AB$3:$AB$229)-COUNTBLANK($AB$3:$AB$229)),\"\",INDEX($AB$3:$AB$229,SMALL(IF($AB$3:$AB$229<>\"\",ROW($AB$3:$AB$229)-2),ROWS($AB$3:AB143))))","v":{"$error":"#N/A"}},null,null,null,null,null,null,null,null,null,null,null,null,null,null,null,null,null,null,null,null,212,2,2,{"$f":"IF(Wycena!$C$16=78,Mapping!AY143,AZ143)","v":2},null,null,320,1,1,{"$f":"IF(Wycena!$C$16=78,Mapping!BE143,BF143)","v":1}]
["DB 411",20,20,"x","x",null,null,null,null,null,null,null,null,null,null,null,null,null,null,null,null,null,null,null,"RAL 6017",500,"RAL 6017",{"$f":"IF((VLOOKUP(Wycena!$C$7,Mapping!$Q$15:$R$20,2,0))=\"tak\",\"\",AA144)","v":"RAL 6017"},{"$f":"IF(ROWS($AB$3:AB144)>(ROWS($AB$3:$AB$229)-COUNTBLANK($AB$3:$AB$229)),\"\",INDEX($AB$3:$AB$229,SMALL(IF($AB$3:$AB$229<>\"\",ROW($AB$3:$AB$229)-2),ROWS($AB$3:AB144))))","v":{"$error":"#N/A"}},null,null,null,null,null,null,null,null,null,null,null,null,null,null,null,null,null,null,null,null,213,2,2,{"$f":"IF(Wycena!$C$16=78,Mapping!AY144,AZ144)","v":2},null,null,321,1,1,{"$f":"IF(Wycena!$C$16=78,Mapping!BE144,BF144)","v":1}]
["DB 412",20,20,"x","x",null,null,null,null,null,null,null,null,null,null,null,null,null,null,null,null,null,null,null,"RAL 6018",500,"RAL 6018",{"$f":"IF((VLOOKUP(Wycena!$C$7,Mapping!$Q$15:$R$20,2,0))=\"tak\",\"\",AA145)","v":"RAL 6018"},{"$f":"IF(ROWS($AB$3:AB145)>(ROWS($AB$3:$AB$229)-COUNTBLANK($AB$3:$AB$229)),\"\",INDEX($AB$3:$AB$229,SMALL(IF($AB$3:$AB$229<>\"\",ROW($AB$3:$AB$229)-2),ROWS($AB$3:AB145))))","v":{"$error":"#N/A"}},null,null,null,null,null,null,null,null,null,null,null,null,null,null,null,null,null,null,null,null,214,2,2,{"$f":"IF(Wycena!$C$16=78,Mapping!AY145,AZ145)","v":2},null,null,322,1,1,{"$f":"IF(Wycena!$C$16=78,Mapping!BE145,BF145)","v":1}]
["DB 413",20,20,"x","x",null,null,null,null,null,null,null,null,null,null,null,null,null,null,null,null,null,null,null,"RAL 6019",500,"RAL 6019",{"$f":"IF((VLOOKUP(Wycena!$C$7,Mapping!$Q$15:$R$20,2,0))=\"tak\",\"\",AA146)","v":"RAL 6019"},{"$f":"IF(ROWS($AB$3:AB146)>(ROWS($AB$3:$AB$229)-COUNTBLANK($AB$3:$AB$229)),\"\",INDEX($AB$3:$AB$229,SMALL(IF($AB$3:$AB$229<>\"\",ROW($AB$3:$AB$229)-2),ROWS($AB$3:AB146))))","v":{"$error":"#N/A"}},null,null,null,null,null,null,null,null,null,null,null,null,null,null,null,null,null,null,null,null,215,2,2,{"$f":"IF(Wycena!$C$16=78,Mapping!AY146,AZ146)","v":2},null,null,323,1,1,{"$f":"IF(Wycena!$C$16=78,Mapping!BE146,BF146)","v":1}]
["DB 414",20,20,"x","x",null,null,null,null,null,null,null,null,null,null,null,null,null,null,null,null,null,null,null,"RAL 6020",500,"RAL 6020",{"$f":"IF((VLOOKUP(Wycena!$C$7,Mapping!$Q$15:$R$20,2,0))=\"tak\",\"\",AA147)","v":"RAL 6020"},{"$f":"IF(ROWS($AB$3:AB147)>(ROWS($AB$3:$AB$229)-COUNTBLANK($AB$3:$AB$229)),\"\",INDEX($AB$3:$AB$229,SMALL(IF($AB$3:$AB$229<>\"\",ROW($AB$3:$AB$229)-2),ROWS($AB$3:AB147))))","v":{"$error":"#N/A"}},null,null,null,null,null,null,null,null,null,null,null,null,null,null,null,null,null,null,null,null,216,2,2,{"$f":"IF(Wycena!$C$16=78,Mapping!AY147,AZ147)","v":2},null,null,324,1,1,{"$f":"IF(Wycena!$C$16=78,Mapping!BE147,BF147)","v":1}]
["DB 415",20,20,"x","x",null,null,null,null,null,null,null,null,null,null,null,null,null,null,null,null,null,null,null,"RAL 6021",500,"RAL 6021",{"$f":"IF((VLOOKUP(Wycena!$C$7,Mapping!$Q$15:$R$20,2,0))=\"tak\",\"\",AA148)","v":"RAL 6021"},{"$f":"IF(ROWS($AB$3:AB148)>(ROWS($AB$3:$AB$229)-COUNTBLANK($AB$3:$AB$229)),\"\",INDEX($AB$3:$AB$229,SMALL(IF($AB$3:$AB$229<>\"\",ROW($AB$3:$AB$229)-2),ROWS($AB$3:AB148))))","v":{"$error":"#N/A"}},null,null,null,null,null,null,null,null,null,null,null,null,null,null,null,null,null,null,null,null,217,2,2,{"$f":"IF(Wycena!$C$16=78,Mapping!AY148,AZ148)","v":2},null,null,325,1,1,{"$f":"IF(Wycena!$C$16=78,Mapping!BE148,BF148)","v":1}]
["DB 431",20,20,"x","x",null,null,null,null,null,null,null,null,null,null,null,null,null,null,null,null,null,null,null,"RAL 6022",500,"RAL 6022",{"$f":"IF((VLOOKUP(Wycena!$C$7,Mapping!$Q$15:$R$20,2,0))=\"tak\",\"\",AA149)","v":"RAL 6022"},{"$f":"IF(ROWS($AB$3:AB149)>(ROWS($AB$3:$AB$229)-COUNTBLANK($AB$3:$AB$229)),\"\",INDEX($AB$3:$AB$229,SMALL(IF($AB$3:$AB$229<>\"\",ROW($AB$3:$AB$229)-2),ROWS($AB$3:AB149))))","v":{"$error":"#N/A"}},null,null,null,null,null,null,null,null,null,null,null,null,null,null,null,null,null,null,null,null,218,2,2,{"$f":"IF(Wycena!$C$16=78,Mapping!AY149,AZ149)","v":2},null,null,326,1,1,{"$f":"IF(Wycena!$C$16=78,Mapping!BE149,BF149)","v":1}]
["DB 432",20,20,"x","x",null,null,null,null,null,null,null,null,null,null,null,null,null,null,null,null,null,null,null,"RAL 6024",500,"RAL 6024",{"$f":"IF((VLOOKUP(Wycena!$C$7,Mapping!$Q$15:$R$20,2,0))=\"tak\",\"\",AA150)","v":"RAL 6024"},{"$f":"IF(ROWS($AB$3:AB150)>(ROWS($AB$3:$AB$229)-COUNTBLANK($AB$3:$AB$229)),\"\",INDEX($AB$3:$AB$229,SMALL(IF($AB$3:$AB$229<>\"\",ROW($AB$3:$AB$229)-2),ROWS($AB$3:AB150))))","v":{"$error":"#N/A"}},null,null,null,null,null,null,null,null,null,null,null,null,null,null,null,null,null,null,null,null,219,2,2,{"$f":"IF(Wycena!$C$16=78,Mapping!AY150,AZ150)","v":2},null,null,327,1,1,{"$f":"IF(Wycena!$C$16=78,Mapping!BE150,BF150)","v":1}]
["DB 450",20,20,"x","x",null,null,null,null,null,null,null,null,null,null,null,null,null,null,null,null,null,null,null,"RAL 6025",500,"RAL 6025",{"$f":"IF((VLOOKUP(Wycena!$C$7,Mapping!$Q$15:$R$20,2,0))=\"tak\",\"\",AA151)","v":"RAL 6025"},{"$f":"IF(ROWS($AB$3:AB151)>(ROWS($AB$3:$AB$229)-COUNTBLANK($AB$3:$AB$229)),\"\",INDEX($AB$3:$AB$229,SMALL(IF($AB$3:$AB$229<>\"\",ROW($AB$3:$AB$229)-2),ROWS($AB$3:AB151))))","v":{"$error":"#N/A"}},null,null,null,null,null,null,null,null,null,null,null,null,null,null,null,null,null,null,null,null,220,2,2,{"$f":"IF(Wycena!$C$16=78,Mapping!AY151,AZ151)","v":2},null,null,328,1,1,{"$f":"IF(Wycena!$C$16=78,Mapping!BE151,BF151)","v":1}]
["DB 502",20,20,"x","x",20,32,36,36,null,null,null,null,null,null,null,null,null,null,null,null,null,null,null,"RAL 6026",500,"RAL 6026",{"$f":"IF((VLOOKUP(Wycena!$C$7,Mapping!$Q$15:$R$20,2,0))=\"tak\",\"\",AA152)","v":"RAL 6026"},{"$f":"IF(ROWS($AB$3:AB152)>(ROWS($AB$3:$AB$229)-COUNTBLANK($AB$3:$AB$229)),\"\",INDEX($AB$3:$AB$229,SMALL(IF($AB$3:$AB$229<>\"\",ROW($AB$3:$AB$229)-2),ROWS($AB$3:AB152))))","v":{"$error":"#N/A"}},null,null,null,null,null,null,null,null,null,null,null,null,null,null,null,null,null,null,null,null,221,2,2,{"$f":"IF(Wycena!$C$16=78,Mapping!AY152,AZ152)","v":2},null,null,329,1,1,{"$f":"IF(Wycena!$C$16=78,Mapping!BE152,BF152)","v":1}]
["DB 506",20,20,"x","x",20,32,36,36,null,null,null,null,null,null,null,null,null,null,null,null,null,null,null,"RAL 6027",500,"RAL 6027",{"$f":"IF((VLOOKUP(Wycena!$C$7,Mapping!$Q$15:$R$20,2,0))=\"tak\",\"\",AA153)","v":"RAL 6027"},{"$f":"IF(ROWS($AB$3:AB153)>(ROWS($AB$3:$AB$229)-COUNTBLANK($AB$3:$AB$229)),\"\",INDEX($AB$3:$AB$229,SMALL(IF($AB$3:$AB$229<>\"\",ROW($AB$3:$AB$229)-2),ROWS($AB$3:AB153))))","v":{"$error":"#N/A"}},null,null,null,null,null,null,null,null,null,null,null,null,null,null,null,null,null,null,null,null,222,2,2,{"$f":"IF(Wycena!$C$16=78,Mapping!AY153,AZ153)","v":2},null,null,330,1,1,{"$f":"IF(Wycena!$C$16=78,Mapping!BE153,BF153)","v":1}]
["DB 510",20,20,"x","x",20,32,36,36,null,null,null,null,null,null,null,null,null,null,null,null,null,null,null,"RAL 6028",500,"RAL 6028",{"$f":"IF((VLOOKUP(Wycena!$C$7,Mapping!$Q$15:$R$20,2,0))=\"tak\",\"\",AA154)","v":"RAL 6028"},{"$f":"IF(ROWS($AB$3:AB154)>(ROWS($AB$3:$AB$229)-COUNTBLANK($AB$3:$AB$229)),\"\",INDEX($AB$3:$AB$229,SMALL(IF($AB$3:$AB$229<>\"\",ROW($AB$3:$AB$229)-2),ROWS($AB$3:AB154))))","v":{"$error":"#N/A"}},null,null,null,null,null,null,null,null,null,null,null,null,null,null,null,null,null,null,null,null,223,2,2,{"$f":"IF(Wycena!$C$16=78,Mapping!AY154,AZ154)","v":2},null,null,331,1,1,{"$f":"IF(Wycena!$C$16=78,Mapping!BE154,BF154)","v":1}]
["DB 511",20,20,"x","x",20,32,36,36,null,null,null,null,null,null,null,null,null,null,null,null,null,null,null,"RAL 6029",500,"RAL 6029",{"$f":"IF((VLOOKUP(Wycena!$C$7,Mapping!$Q$15:$R$20,2,0))=\"tak\",\"\",AA155)","v":"RAL 6029"},{"$f":"IF(ROWS($AB$3:AB155)>(ROWS($AB$3:$AB$229)-COUNTBLANK($AB$3:$AB$229)),\"\",INDEX($AB$3:$AB$229,SMALL(IF($AB$3:$AB$229<>\"\",ROW($AB$3:$AB$229)-2),ROWS($AB$3:AB155))))","v":{"$error":"#N/A"}},null,null,null,null,null,null,null,null,null,null,null,null,null,null,null,null,null,null,null,null,224,2,2,{"$f":"IF(Wycena!$C$16=78,Mapping!AY155,AZ155)","v":2},null,null,332,1,1,{"$f":"IF(Wycena!$C$16=78,Mapping!BE155,BF155)","v":1}]
["DB 512",20,20,"x","x",20,32,36,36,null,null,null,null,null,null,null,null,null,null,null,null,null,null,null,"RAL 6032",500,"RAL 6032",{"$f":"IF((VLOOKUP(Wycena!$C$7,Mapping!$Q$15:$R$20,2,0))=\"tak\",\"\",AA156)","v":"RAL 6032"},{"$f":"IF(ROWS($AB$3:AB156)>(ROWS($AB$3:$AB$229)-COUNTBLANK($AB$3:$AB$229)),\"\",INDEX($AB$3:$AB$229,SMALL(IF($AB$3:$AB$229<>\"\",ROW($AB$3:$AB$229)-2),ROWS($AB$3:AB156))))","v":{"$error":"#N/A"}},null,null,null,null,null,null,null,null,null,null,null,null,null,null,null,null,null,null,null,null,225,2,2,{"$f":"IF(Wycena!$C$16=78,Mapping!AY156,AZ156)","v":2},null,null,333,1,1,{"$f":"IF(Wycena!$C$16=78,Mapping!BE156,BF156)","v":1}]
["DB 513",20,20,"x","x",20,32,36,36,null,null,null,null,null,null,null,null,null,null,null,null,null,null,null,"RAL 6033",500,"RAL 6033",{"$f":"IF((VLOOKUP(Wycena!$C$7,Mapping!$Q$15:$R$20,2,0))=\"tak\",\"\",AA157)","v":"RAL 6033"},{"$f":"IF(ROWS($AB$3:AB157)>(ROWS($AB$3:$AB$229)-COUNTBLANK($AB$3:$AB$229)),\"\",INDEX($AB$3:$AB$229,SMALL(IF($AB$3:$AB$229<>\"\",ROW($AB$3:$AB$229)-2),ROWS($AB$3:AB157))))","v":{"$error":"#N/A"}},null,null,null,null,null,null,null,null,null,null,null,null,null,null,null,null,null,null,null,null,226,2,2,{"$f":"IF(Wycena!$C$16=78,Mapping!AY157,AZ157)","v":2},null,null,334,1,1,{"$f":"IF(Wycena!$C$16=78,Mapping!BE157,BF157)","v":1}]
["DB 514",20,20,"x","x",20,32,36,36,null,null,null,null,null,null,null,null,null,null,null,null,null,null,null,"RAL 6034",500,"RAL 6034",{"$f":"IF((VLOOKUP(Wycena!$C$7,Mapping!$Q$15:$R$20,2,0))=\"tak\",\"\",AA158)","v":"RAL 6034"},{"$f":"IF(ROWS($AB$3:AB158)>(ROWS($AB$3:$AB$229)-COUNTBLANK($AB$3:$AB$229)),\"\",INDEX($AB$3:$AB$229,SMALL(IF($AB$3:$AB$229<>\"\",ROW($AB$3:$AB$229)-2),ROWS($AB$3:AB158))))","v":{"$error":"#N/A"}},null,null,null,null,null,null,null,null,null,null,null,null,null,null,null,null,null,null,null,null,227,2,2,{"$f":"IF(Wycena!$C$16=78,Mapping!AY158,AZ158)","v":2},null,null,335,1,1,{"$f":"IF(Wycena!$C$16=78,Mapping!BE158,BF158)","v":1}]
["DB 515",20,20,"x","x",20,32,36,36,null,null,null,null,null,null,null,null,null,null,null,null,null,null,null,"RAL 6035",500,"RAL 6035",{"$f":"IF((VLOOKUP(Wycena!$C$7,Mapping!$Q$15:$R$20,2,0))=\"tak\",\"\",AA159)","v":"RAL 6035"},{"$f":"IF(ROWS($AB$3:AB159)>(ROWS($AB$3:$AB$229)-COUNTBLANK($AB$3:$AB$229)),\"\",INDEX($AB$3:$AB$229,SMALL(IF($AB$3:$AB$229<>\"\",ROW($AB$3:$AB$229)-2),ROWS($AB$3:AB159))))","v":{"$error":"#N/A"}},null,null,null,null,null,null,null,null,null,null,null,null,null,null,null,null,null,null,null,null,228,2,2,{"$f":"IF(Wycena!$C$16=78,Mapping!AY159,AZ159)","v":2},null,null,336,1,1,{"$f":"IF(Wycena!$C$16=78,Mapping!BE159,BF159)","v":1}]
["DB 517",20,20,"x","x",20,32,36,36,null,null,null,null,null,null,null,null,null,null,null,null,null,null,null,"RAL 6036",500,"RAL 6036",{"$f":"IF((VLOOKUP(Wycena!$C$7,Mapping!$Q$15:$R$20,2,0))=\"tak\",\"\",AA160)","v":"RAL 6036"},{"$f":"IF(ROWS($AB$3:AB160)>(ROWS($AB$3:$AB$229)-COUNTBLANK($AB$3:$AB$229)),\"\",INDEX($AB$3:$AB$229,SMALL(IF($AB$3:$AB$229<>\"\",ROW($AB$3:$AB$229)-2),ROWS($AB$3:AB160))))","v":{"$error":"#N/A"}},null,null,null,null,null,null,null,null,null,null,null,null,null,null,null,null,null,null,null,null,230,2,2,{"$f":"IF(Wycena!$C$16=78,Mapping!AY160,AZ160)","v":2},null,null,338,1,1,{"$f":"IF(Wycena!$C$16=78,Mapping!BE160,BF160)","v":1}]
["DB 601",20,20,"x","x",20,32,36,36,null,null,null,null,null,null,null,null,null,null,null,null,null,null,null,"RAL 6038",500,"RAL 6038",{"$f":"IF((VLOOKUP(Wycena!$C$7,Mapping!$Q$15:$R$20,2,0))=\"tak\",\"\",AA161)","v":"RAL 6038"},{"$f":"IF(ROWS($AB$3:AB161)>(ROWS($AB$3:$AB$229)-COUNTBLANK($AB$3:$AB$229)),\"\",INDEX($AB$3:$AB$229,SMALL(IF($AB$3:$AB$229<>\"\",ROW($AB$3:$AB$229)-2),ROWS($AB$3:AB161))))","v":{"$error":"#N/A"}},null,null,null,null,null,null,null,null,null,null,null,null,null,null,null,null,null,null,null,null,231,2,2,{"$f":"IF(Wycena!$C$16=78,Mapping!AY161,AZ161)","v":2},null,null,339,1,1,{"$f":"IF(Wycena!$C$16=78,Mapping!BE161,BF161)","v":1}]
["DB 602",20,20,"x","x",20,32,36,36,null,null,null,null,null,null,null,null,null,null,null,null,null,null,null,"RAL 7000",500,"RAL 7000",{"$f":"IF((VLOOKUP(Wycena!$C$7,Mapping!$Q$15:$R$20,2,0))=\"tak\",\"\",AA162)","v":"RAL 7000"},{"$f":"IF(ROWS($AB$3:AB162)>(ROWS($AB$3:$AB$229)-COUNTBLANK($AB$3:$AB$229)),\"\",INDEX($AB$3:$AB$229,SMALL(IF($AB$3:$AB$229<>\"\",ROW($AB$3:$AB$229)-2),ROWS($AB$3:AB162))))","v":{"$error":"#N/A"}},null,null,null,null,null,null,null,null,null,null,null,null,null,null,null,null,null,null,null,null,232,2,2,{"$f":"IF(Wycena!$C$16=78,Mapping!AY162,AZ162)","v":2},null,null,340,1,1,{"$f":"IF(Wycena!$C$16=78,Mapping!BE162,BF162)","v":1}]
["DB 603",20,20,"x","x",20,32,36,36,null,null,null,null,null,null,null,null,null,null,null,null,null,null,null,"RAL 7001",500,"RAL 7001",{"$f":"IF((VLOOKUP(Wycena!$C$7,Mapping!$Q$15:$R$20,2,0))=\"tak\",\"\",AA163)","v":"RAL 7001"},{"$f":"IF(ROWS($AB$3:AB163)>(ROWS($AB$3:$AB$229)-COUNTBLANK($AB$3:$AB$229)),\"\",INDEX($AB$3:$AB$229,SMALL(IF($AB$3:$AB$229<>\"\",ROW($AB$3:$AB$229)-2),ROWS($AB$3:AB163))))","v":{"$error":"#N/A"}},null,null,null,null,null,null,null,null,null,null,null,null,null,null,null,null,null,null,null,null,233,2,2,{"$f":"IF(Wycena!$C$16=78,Mapping!AY163,AZ163)","v":2},null,null,341,1,1,{"$f":"IF(Wycena!$C$16=78,Mapping!BE163,BF163)","v":1}]
["DB 604",20,20,"x","x",20,32,36,36,null,null,null,null,null,null,null,null,null,null,null,null,null,null,null,"RAL 7002",500,"RAL 7002",{"$f":"IF((VLOOKUP(Wycena!$C$7,Mapping!$Q$15:$R$20,2,0))=\"tak\",\"\",AA164)","v":"RAL 7002"},{"$f":"IF(ROWS($AB$3:AB164)>(ROWS($AB$3:$AB$229)-COUNTBLANK($AB$3:$AB$229)),\"\",INDEX($AB$3:$AB$229,SMALL(IF($AB$3:$AB$229<>\"\",ROW($AB$3:$AB$229)-2),ROWS($AB$3:AB164))))","v":{"$error":"#N/A"}},null,null,null,null,null,null,null,null,null,null,null,null,null,null,null,null,null,null,null,null,234,2,2,{"$f":"IF(Wycena!$C$16=78,Mapping!AY164,AZ164)","v":2},null,null,342,1,1,{"$f":"IF(Wycena!$C$16=78,Mapping!BE164,BF164)","v":1}]
["DB 605",20,20,"x","x",20,32,36,36,null,null,null,null,null,null,null,null,null,null,null,null,null,null,null,"RAL 7003",500,"RAL 7003",{"$f":"IF((VLOOKUP(Wycena!$C$7,Mapping!$Q$15:$R$20,2,0))=\"tak\",\"\",AA165)","v":"RAL 7003"},{"$f":"IF(ROWS($AB$3:AB165)>(ROWS($AB$3:$AB$229)-COUNTBLANK($AB$3:$AB$229)),\"\",INDEX($AB$3:$AB$229,SMALL(IF($AB$3:$AB$229<>\"\",ROW($AB$3:$AB$229)-2),ROWS($AB$3:AB165))))","v":{"$error":"#N/A"}},null,null,null,null,null,null,null,null,null,null,null,null,null,null,null,null,null,null,null,null,235,2,2,{"$f":"IF(Wycena!$C$16=78,Mapping!AY165,AZ165)","v":2},null,null,343,1,1,{"$f":"IF(Wycena!$C$16=78,Mapping!BE165,BF165)","v":1}]
["DB 606",20,20,"x","x",20,32,36,36,null,null,null,null,null,null,null,null,null,null,null,null,null,null,null,"RAL 7004",500,"RAL 7004",{"$f":"IF((VLOOKUP(Wycena!$C$7,Mapping!$Q$15:$R$20,2,0))=\"tak\",\"\",AA166)","v":"RAL 7004"},{"$f":"IF(ROWS($AB$3:AB166)>(ROWS($AB$3:$AB$229)-COUNTBLANK($AB$3:$AB$229)),\"\",INDEX($AB$3:$AB$229,SMALL(IF($AB$3:$AB$229<>\"\",ROW($AB$3:$AB$229)-2),ROWS($AB$3:AB166))))","v":{"$error":"#N/A"}},null,null,null,null,null,null,null,null,null,null,null,null,null,null,null,null,null,null,null,null,236,2,2,{"$f":"IF(Wycena!$C$16=78,Mapping!AY166,AZ166)","v":2},null,null,344,1,1,{"$f":"IF(Wycena!$C$16=78,Mapping!BE166,BF166)","v":1}]
["DB 607",20,20,"x","x",20,32,36,36,null,null,null,null,null,null,null,null,null,null,null,null,null,null,null,"RAL 7005",500,"RAL 7005",{"$f":"IF((VLOOKUP(Wycena!$C$7,Mapping!$Q$15:$R$20,2,0))=\"tak\",\"\",AA167)","v":"RAL 7005"},{"$f":"IF(ROWS($AB$3:AB167)>(ROWS($AB$3:$AB$229)-COUNTBLANK($AB$3:$AB$229)),\"\",INDEX($AB$3:$AB$229,SMALL(IF($AB$3:$AB$229<>\"\",ROW($AB$3:$AB$229)-2),ROWS($AB$3:AB167))))","v":{"$error":"#N/A"}},null,null,null,null,null,null,null,null,null,null,null,null,null,null,null,null,null,null,null,null,237,2,2,{"$f":"IF(Wycena!$C$16=78,Mapping!AY167,AZ167)","v":2},null,null,345,1,1,{"$f":"IF(Wycena!$C$16=78,Mapping!BE167,BF167)","v":1}]
["DB 609",20,20,"x","x",20,32,36,36,null,null,null,null,null,null,null,null,null,null,null,null,null,null,null,"RAL 7006",500,"RAL 7006",{"$f":"IF((VLOOKUP(Wycena!$C$7,Mapping!$Q$15:$R$20,2,0))=\"tak\",\"\",AA168)","v":"RAL 7006"},{"$f":"IF(ROWS($AB$3:AB168)>(ROWS($AB$3:$AB$229)-COUNTBLANK($AB$3:$AB$229)),\"\",INDEX($AB$3:$AB$229,SMALL(IF($AB$3:$AB$229<>\"\",ROW($AB$3:$AB$229)-2),ROWS($AB$3:AB168))))","v":{"$error":"#N/A"}},null,null,null,null,null,null,null,null,null,null,null,null,null,null,null,null,null,null,null,null,238,2,2,{"$f":"IF(Wycena!$C$16=78,Mapping!AY168,AZ168)","v":2},null,null,346,1,1,{"$f":"IF(Wycena!$C$16=78,Mapping!BE168,BF168)","v":1}]
[null,null,null,null,null,null,null,null,null,null,null,null,null,null,null,null,null,null,null,null,null,null,null,null,"RAL 7008",500,"RAL 7008",{"$f":"IF((VLOOKUP(Wycena!$C$7,Mapping!$Q$15:$R$20,2,0))=\"tak\",\"\",AA169)","v":"RAL 7008"},{"$f":"IF(ROWS($AB$3:AB169)>(ROWS($AB$3:$AB$229)-COUNTBLANK($AB$3:$AB$229)),\"\",INDEX($AB$3:$AB$229,SMALL(IF($AB$3:$AB$229<>\"\",ROW($AB$3:$AB$229)-2),ROWS($AB$3:AB169))))","v":{"$error":"#N/A"}},null,null,null,null,null,null,null,null,null,null,null,null,null,null,null,null,null,null,null,null,239,2,2,{"$f":"IF(Wycena!$C$16=78,Mapping!AY169,AZ169)","v":2},null,null,347,1,1,{"$f":"IF(Wycena!$C$16=78,Mapping!BE169,BF169)","v":1}]
[null,null,null,null,null,null,null,null,null,null,null,null,null,null,null,null,null,null,null,null,null,null,null,null,"RAL 7009",500,"RAL 7009",{"$f":"IF((VLOOKUP(Wycena!$C$7,Mapping!$Q$15:$R$20,2,0))=\"tak\",\"\",AA170)","v":"RAL 7009"},{"$f":"IF(ROWS($AB$3:AB170)>(ROWS($AB$3:$AB$229)-COUNTBLANK($AB$3:$AB$229)),\"\",INDEX($AB$3:$AB$229,SMALL(IF($AB$3:$AB$229<>\"\",ROW($AB$3:$AB$229)-2),ROWS($AB$3:AB170))))","v":{"$error":"#N/A"}},null,null,null,null,null,null,null,null,null,null,null,null,null,null,null,null,null,null,null,null,240,2,2,{"$f":"IF(Wycena!$C$16=78,Mapping!AY170,AZ170)","v":2},null,null,348,1,1,{"$f":"IF(Wycena!$C$16=78,Mapping!BE170,BF170)","v":1}]
[null,null,null,null,null,null,null,null,null,null,null,null,null,null,null,null,null,null,null,null,null,null,null,null,"RAL 7010",500,"RAL 7010",{"$f":"IF((VLOOKUP(Wycena!$C$7,Mapping!$Q$15:$R$20,2,0))=\"tak\",\"\",AA171)","v":"RAL 7010"},{"$f":"IF(ROWS($AB$3:AB171)>(ROWS($AB$3:$AB$229)-COUNTBLANK($AB$3:$AB$229)),\"\",INDEX($AB$3:$AB$229,SMALL(IF($AB$3:$AB$229<>\"\",ROW($AB$3:$AB$229)-2),ROWS($AB$3:AB171))))","v":{"$error":"#N/A"}},null,null,null,null,null,null,null,null,null,null,null,null,null,null,null,null,null,null,null,null,241,2,2,{"$f":"IF(Wycena!$C$16=78,Mapping!AY171,AZ171)","v":2},null,null,349,1,1,{"$f":"IF(Wycena!$C$16=78,Mapping!BE171,BF171)","v":1}]
[null,null,null,null,null,null,null,null,null,null,null,null,null,null,null,null,null,null,null,null,null,null,null,null,"RAL 7011",500,"RAL 7011",{"$f":"IF((VLOOKUP(Wycena!$C$7,Mapping!$Q$15:$R$20,2,0))=\"tak\",\"\",AA172)","v":"RAL 7011"},{"$f":"IF(ROWS($AB$3:AB172)>(ROWS($AB$3:$AB$229)-COUNTBLANK($AB$3:$AB$229)),\"\",INDEX($AB$3:$AB$229,SMALL(IF($AB$3:$AB$229<>\"\",ROW($AB$3:$AB$229)-2),ROWS($AB$3:AB172))))","v":{"$error":"#N/A"}},null,null,null,null,null,null,null,null,null,null,null,null,null,null,null,null,null,null,null,null,242,2,2,{"$f":"IF(Wycena!$C$16=78,Mapping!AY172,AZ172)","v":2},null,null,350,1,1,{"$f":"IF(Wycena!$C$16=78,Mapping!BE172,BF172)","v":1}]
[null,null,null,null,null,null,null,null,null,null,null,null,null,null,null,null,null,null,null,null,null,null,null,null,"RAL 7012",500,"RAL 7012",{"$f":"IF((VLOOKUP(Wycena!$C$7,Mapping!$Q$15:$R$20,2,0))=\"tak\",\"\",AA173)","v":"RAL 7012"},{"$f":"IF(ROWS($AB$3:AB173)>(ROWS($AB$3:$AB$229)-COUNTBLANK($AB$3:$AB$229)),\"\",INDEX($AB$3:$AB$229,SMALL(IF($AB$3:$AB$229<>\"\",ROW($AB$3:$AB$229)-2),ROWS($AB$3:AB173))))","v":{"$error":"#N/A"}},null,null,null,null,null,null,null,null,null,null,null,null,null,null,null,null,null,null,null,null,243,2,2,{"$f":"IF(Wycena!$C$16=78,Mapping!AY173,AZ173)","v":2}]
[null,null,null,null,null,null,null,null,null,null,null,null,null,null,null,null,null,null,null,null,null,null,null,null,"RAL 7013",500,"RAL 7013",{"$f":"IF((VLOOKUP(Wycena!$C$7,Mapping!$Q$15:$R$20,2,0))=\"tak\",\"\",AA174)","v":"RAL 7013"},{"$f":"IF(ROWS($AB$3:AB174)>(ROWS($AB$3:$AB$229)-COUNTBLANK($AB$3:$AB$229)),\"\",INDEX($AB$3:$AB$229,SMALL(IF($AB$3:$AB$229<>\"\",ROW($AB$3:$AB$229)-2),ROWS($AB$3:AB174))))","v":{"$error":"#N/A"}},null,null,null,null,null,null,null,null,null,null,null,null,null,null,null,null,null,null,null,null,244,2,2,{"$f":"IF(Wycena!$C$16=78,Mapping!AY174,AZ174)","v":2}]
[null,null,null,null,null,null,null,null,null,null,null,null,null,null,null,null,null,null,null,null,null,null,null,null,"RAL 7015",500,"RAL 7015",{"$f":"IF((VLOOKUP(Wycena!$C$7,Mapping!$Q$15:$R$20,2,0))=\"tak\",\"\",AA175)","v":"RAL 7015"},{"$f":"IF(ROWS($AB$3:AB175)>(ROWS($AB$3:$AB$229)-COUNTBLANK($AB$3:$AB$229)),\"\",INDEX($AB$3:$AB$229,SMALL(IF($AB$3:$AB$229<>\"\",ROW($AB$3:$AB$229)-2),ROWS($AB$3:AB175))))","v":{"$error":"#N/A"}},null,null,null,null,null,null,null,null,null,null,null,null,null,null,null,null,null,null,null,null,245,2,2,{"$f":"IF(Wycena!$C$16=78,Mapping!AY175,AZ175)","v":2}]
[null,null,null,null,null,null,null,null,null,null,null,null,null,null,null,null,null,null,null,null,null,null,null,null,"RAL 7021",500,"RAL 7021",{"$f":"IF((VLOOKUP(Wycena!$C$7,Mapping!$Q$15:$R$20,2,0))=\"tak\",\"\",AA176)","v":"RAL 7021"},{"$f":"IF(ROWS($AB$3:AB176)>(ROWS($AB$3:$AB$229)-COUNTBLANK($AB$3:$AB$229)),\"\",INDEX($AB$3:$AB$229,SMALL(IF($AB$3:$AB$229<>\"\",ROW($AB$3:$AB$229)-2),ROWS($AB$3:AB176))))","v":{"$error":"#N/A"}},null,null,null,null,null,null,null,null,null,null,null,null,null,null,null,null,null,null,null,null,246,2,2,{"$f":"IF(Wycena!$C$16=78,Mapping!AY176,AZ176)","v":2}]
[null,null,null,null,null,null,null,null,null,null,null,null,null,null,null,null,null,null,null,null,null,null,null,null,"RAL 7022",500,"RAL 7022",{"$f":"IF((VLOOKUP(Wycena!$C$7,Mapping!$Q$15:$R$20,2,0))=\"tak\",\"\",AA177)","v":"RAL 7022"},{"$f":"IF(ROWS($AB$3:AB177)>(ROWS($AB$3:$AB$229)-COUNTBLANK($AB$3:$AB$229)),\"\",INDEX($AB$3:$AB$229,SMALL(IF($AB$3:$AB$229<>\"\",ROW($AB$3:$AB$229)-2),ROWS($AB$3:AB177))))","v":{"$error":"#N/A"}},null,null,null,null,null,null,null,null,null,null,null,null,null,null,null,null,null,null,null,null,247,2,2,{"$f":"IF(Wycena!$C$16=78,Mapping!AY177,AZ177)","v":2}]
[null,null,null,null,null,null,null,null,null,null,null,null,null,null,null,null,null,null,null,null,null,null,null,null,"RAL 7023",500,"RAL 7023",{"$f":"IF((VLOOKUP(Wycena!$C$7,Mapping!$Q$15:$R$20,2,0))=\"tak\",\"\",AA178)","v":"RAL 7023"},{"$f":"IF(ROWS($AB$3:AB178)>(ROWS($AB$3:$AB$229)-COUNTBLANK($AB$3:$AB$229)),\"\",INDEX($AB$3:$AB$229,SMALL(IF($AB$3:$AB$229<>\"\",ROW($AB$3:$AB$229)-2),ROWS($AB$3:AB178))))","v":{"$error":"#N/A"}},null,null,null,null,null,null,null,null,null,null,null,null,null,null,null,null,null,null,null,null,248,2,2,{"$f":"IF(Wycena!$C$16=78,Mapping!AY178,AZ178)","v":2}]
[null,null,null,null,null,null,null,null,null,null,null,null,null,null,null,null,null,null,null,null,null,null,null,null,"RAL 7024",500,"RAL 7024",{"$f":"IF((VLOOKUP(Wycena!$C$7,Mapping!$Q$15:$R$20,2,0))=\"tak\",\"\",AA179)","v":"RAL 7024"},{"$f":"IF(ROWS($AB$3:AB179)>(ROWS($AB$3:$AB$229)-COUNTBLANK($AB$3:$AB$229)),\"\",INDEX($AB$3:$AB$229,SMALL(IF($AB$3:$AB$229<>\"\",ROW($AB$3:$AB$229)-2),ROWS($AB$3:AB179))))","v":{"$error":"#N/A"}},null,null,null,null,null,null,null,null,null,null,null,null,null,null,null,null,null,null,null,null,249,2,2,{"$f":"IF(Wycena!$C$16=78,Mapping!AY179,AZ179)","v":2}]
[null,null,null,null,null,null,null,null,null,null,null,null,null,null,null,null,null,null,null,null,null,null,null,null,"RAL 7026",500,"RAL 7026",{"$f":"IF((VLOOKUP(Wycena!$C$7,Mapping!$Q$15:$R$20,2,0))=\"tak\",\"\",AA180)","v":"RAL 7026"},{"$f":"IF(ROWS($AB$3:AB180)>(ROWS($AB$3:$AB$229)-COUNTBLANK($AB$3:$AB$229)),\"\",INDEX($AB$3:$AB$229,SMALL(IF($AB$3:$AB$229<>\"\",ROW($AB$3:$AB$229)-2),ROWS($AB$3:AB180))))","v":{"$error":"#N/A"}},null,null,null,null,null,null,null,null,null,null,null,null,null,null,null,null,null,null,null,null,250,2,2,{"$f":"IF(Wycena!$C$16=78,Mapping!AY180,AZ180)","v":2}]
[null,null,null,null,null,null,null,null,null,null,null,null,null,null,null,null,null,null,null,null,null,null,null,null,"RAL 7030",500,"RAL 7030",{"$f":"IF((VLOOKUP(Wycena!$C$7,Mapping!$Q$15:$R$20,2,0))=\"tak\",\"\",AA181)","v":"RAL 7030"},{"$f":"IF(ROWS($AB$3:AB181)>(ROWS($AB$3:$AB$229)-COUNTBLANK($AB$3:$AB$229)),\"\",INDEX($AB$3:$AB$229,SMALL(IF($AB$3:$AB$229<>\"\",ROW($AB$3:$AB$229)-2),ROWS($AB$3:AB181))))","v":{"$error":"#N/A"}},null,null,null,null,null,null,null,null,null,null,null,null,null,null,null,null,null,null,null,null,251,2,2,{"$f":"IF(Wycena!$C$16=78,Mapping!AY181,AZ181)","v":2}]
[null,null,null,null,null,null,null,null,null,null,null,null,null,null,null,null,null,null,null,null,null,null,null,null,"RAL 7031",500,"RAL 7031",{"$f":"IF((VLOOKUP(Wycena!$C$7,Mapping!$Q$15:$R$20,2,0))=\"tak\",\"\",AA182)","v":"RAL 7031"},{"$f":"IF(ROWS($AB$3:AB182)>(ROWS($AB$3:$AB$229)-COUNTBLANK($AB$3:$AB$229)),\"\",INDEX($AB$3:$AB$229,SMALL(IF($AB$3:$AB$229<>\"\",ROW($AB$3:$AB$229)-2),ROWS($AB$3:AB182))))","v":{"$error":"#N/A"}},null,null,null,null,null,null,null,null,null,null,null,null,null,null,null,null,null,null,null,null,252,2,2,{"$f":"IF(Wycena!$C$16=78,Mapping!AY182,AZ182)","v":2}]
[null,null,null,null,null,null,null,null,null,null,null,null,null,null,null,null,null,null,null,null,null,null,null,null,"RAL 7032",500,"RAL 7032",{"$f":"IF((VLOOKUP(Wycena!$C$7,Mapping!$Q$15:$R$20,2,0))=\"tak\",\"\",AA183)","v":"RAL 7032"},{"$f":"IF(ROWS($AB$3:AB183)>(ROWS($AB$3:$AB$229)-COUNTBLANK($AB$3:$AB$229)),\"\",INDEX($AB$3:$AB$229,SMALL(IF($AB$3:$AB$229<>\"\",ROW($AB$3:$AB$229)-2),ROWS($AB$3:AB183))))","v":{"$error":"#N/A"}},null,null,null,null,null,null,null,null,null,null,null,null,null,null,null,null,null,null,null,null,253,2,2,{"$f":"IF(Wycena!$C$16=78,Mapping!AY183,AZ183)","v":2}]
[null,null,null,null,null,null,null,null,null,null,null,null,null,null,null,null,null,null,null,null,null,null,null,null,"RAL 7033",500,"RAL 7033",{"$f":"IF((VLOOKUP(Wycena!$C$7,Mapping!$Q$15:$R$20,2,0))=\"tak\",\"\",AA184)","v":"RAL 7033"},{"$f":"IF(ROWS($AB$3:AB184)>(ROWS($AB$3:$AB$229)-COUNTBLANK($AB$3:$AB$229)),\"\",INDEX($AB$3:$AB$229,SMALL(IF($AB$3:$AB$229<>\"\",ROW($AB$3:$AB$229)-2),ROWS($AB$3:AB184))))","v":{"$error":"#N/A"}},null,null,null,null,null,null,null,null,null,null,null,null,null,null,null,null,null,null,null,null,254,2,2,{"$f":"IF(Wycena!$C$16=78,Mapping!AY184,AZ184)","v":2}]
[null,null,null,null,null,null,null,null,null,null,null,null,null,null,null,null,null,null,null,null,null,null,null,null,"RAL 7034",500,"RAL 7034",{"$f":"IF((VLOOKUP(Wycena!$C$7,Mapping!$Q$15:$R$20,2,0))=\"tak\",\"\",AA185)","v":"RAL 7034"},{"$f":"IF(ROWS($AB$3:AB185)>(ROWS($AB$3:$AB$229)-COUNTBLANK($AB$3:$AB$229)),\"\",INDEX($AB$3:$AB$229,SMALL(IF($AB$3:$AB$229<>\"\",ROW($AB$3:$AB$229)-2),ROWS($AB$3:AB185))))","v":{"$error":"#N/A"}},null,null,null,null,null,null,null,null,null,null,null,null,null,null,null,null,null,null,null,null,255,2,2,{"$f":"IF(Wycena!$C$16=78,Mapping!AY185,AZ185)","v":2}]
[null,null,null,null,null,null,null,null,null,null,null,null,null,null,null,null,null,null,null,null,null,null,null,null,"RAL 7035",500,"RAL 7035",{"$f":"IF((VLOOKUP(Wycena!$C$7,Mapping!$Q$15:$R$20,2,0))=\"tak\",\"\",AA186)","v":"RAL 7035"},{"$f":"IF(ROWS($AB$3:AB186)>(ROWS($AB$3:$AB$229)-COUNTBLANK($AB$3:$AB$229)),\"\",INDEX($AB$3:$AB$229,SMALL(IF($AB$3:$AB$229<>\"\",ROW($AB$3:$AB$229)-2),ROWS($AB$3:AB186))))","v":{"$error":"#N/A"}},null,null,null,null,null,null,null,null,null,null,null,null,null,null,null,null,null,null,null,null,256,2,2,{"$f":"IF(Wycena!$C$16=78,Mapping!AY186,AZ186)","v":2}]
[null,null,null,null,null,null,null,null,null,null,null,null,null,null,null,null,null,null,null,null,null,null,null,null,"RAL 7036",500,"RAL 7036",{"$f":"IF((VLOOKUP(Wycena!$C$7,Mapping!$Q$15:$R$20,2,0))=\"tak\",\"\",AA187)","v":"RAL 7036"},{"$f":"IF(ROWS($AB$3:AB187)>(ROWS($AB$3:$AB$229)-COUNTBLANK($AB$3:$AB$229)),\"\",INDEX($AB$3:$AB$229,SMALL(IF($AB$3:$AB$229<>\"\",ROW($AB$3:$AB$229)-2),ROWS($AB$3:AB187))))","v":{"$error":"#N/A"}},null,null,null,null,null,null,null,null,null,null,null,null,null,null,null,null,null,null,null,null,257,2,2,{"$f":"IF(Wycena!$C$16=78,Mapping!AY187,AZ187)","v":2}]
[null,null,null,null,null,null,null,null,null,null,null,null,null,null,null,null,null,null,null,null,null,null,null,null,"RAL 7037",500,"RAL 7037",{"$f":"IF((VLOOKUP(Wycena!$C$7,Mapping!$Q$15:$R$20,2,0))=\"tak\",\"\",AA188)","v":"RAL 7037"},{"$f":"IF(ROWS($AB$3:AB188)>(ROWS($AB$3:$AB$229)-COUNTBLANK($AB$3:$AB$229)),\"\",INDEX($AB$3:$AB$229,SMALL(IF($AB$3:$AB$229<>\"\",ROW($AB$3:$AB$229)-2),ROWS($AB$3:AB188))))","v":{"$error":"#N/A"}},null,null,null,null,null,null,null,null,null,null,null,null,null,null,null,null,null,null,null,null,258,2,2,{"$f":"IF(Wycena!$C$16=78,Mapping!AY188,AZ188)","v":2}]
[null,null,null,null,null,null,null,null,null,null,null,null,null,null,null,null,null,null,null,null,null,null,null,null,"RAL 7038",500,"RAL 7038",{"$f":"IF((VLOOKUP(Wycena!$C$7,Mapping!$Q$15:$R$20,2,0))=\"tak\",\"\",AA189)","v":"RAL 7038"},{"$f":"IF(ROWS($AB$3:AB189)>(ROWS($AB$3:$AB$229)-COUNTBLANK($AB$3:$AB$229)),\"\",INDEX($AB$3:$AB$229,SMALL(IF($AB$3:$AB$229<>\"\",ROW($AB$3:$AB$229)-2),ROWS($AB$3:AB189))))","v":{"$error":"#N/A"}},null,null,null,null,null,null,null,null,null,null,null,null,null,null,null,null,null,null,null,null,259,2,2,{"$f":"IF(Wycena!$C$16=78,Mapping!AY189,AZ189)","v":2}]
[null,null,null,null,null,null,null,null,null,null,null,null,null,null,null,null,null,null,null,null,null,null,null,null,"RAL 7039",500,"RAL 7039",{"$f":"IF((VLOOKUP(Wycena!$C$7,Mapping!$Q$15:$R$20,2,0))=\"tak\",\"\",AA190)","v":"RAL 7039"},{"$f":"IF(ROWS($AB$3:AB190)>(ROWS($AB$3:$AB$229)-COUNTBLANK($AB$3:$AB$229)),\"\",INDEX($AB$3:$AB$229,SMALL(IF($AB$3:$AB$229<>\"\",ROW($AB$3:$AB$229)-2),ROWS($AB$3:AB190))))","v":{"$error":"#N/A"}},null,null,null,null,null,null,null,null,null,null,null,null,null,null,null,null,null,null,null,null,260,2,2,{"$f":"IF(Wycena!$C$16=78,Mapping!AY190,AZ190)","v":2}]
[null,null,null,null,null,null,null,null,null,null,null,null,null,null,null,null,null,null,null,null,null,null,null,null,"RAL 7042",500,"RAL 7042",{"$f":"IF((VLOOKUP(Wycena!$C$7,Mapping!$Q$15:$R$20,2,0))=\"tak\",\"\",AA191)","v":"RAL 7042"},{"$f":"IF(ROWS($AB$3:AB191)>(ROWS($AB$3:$AB$229)-COUNTBLANK($AB$3:$AB$229)),\"\",INDEX($AB$3:$AB$229,SMALL(IF($AB$3:$AB$229<>\"\",ROW($AB$3:$AB$229)-2),ROWS($AB$3:AB191))))","v":{"$error":"#N/A"}},null,null,null,null,null,null,null,null,null,null,null,null,null,null,null,null,null,null,null,null,261,2,2,{"$f":"IF(Wycena!$C$16=78,Mapping!AY191,AZ191)","v":2}]
[null,null,null,null,null,null,null,null,null,null,null,null,null,null,null,null,null,null,null,null,null,null,null,null,"RAL 7043",500,"RAL 7043",{"$f":"IF((VLOOKUP(Wycena!$C$7,Mapping!$Q$15:$R$20,2,0))=\"tak\",\"\",AA192)","v":"RAL 7043"},{"$f":"IF(ROWS($AB$3:AB192)>(ROWS($AB$3:$AB$229)-COUNTBLANK($AB$3:$AB$229)),\"\",INDEX($AB$3:$AB$229,SMALL(IF($AB$3:$AB$229<>\"\",ROW($AB$3:$AB$229)-2),ROWS($AB$3:AB192))))","v":{"$error":"#N/A"}},null,null,null,null,null,null,null,null,null,null,null,null,null,null,null,null,null,null,null,null,262,2,2,{"$f":"IF(Wycena!$C$16=78,Mapping!AY192,AZ192)","v":2}]
[null,null,null,null,null,null,null,null,null,null,null,null,null,null,null,null,null,null,null,null,null,null,null,null,"RAL 7044",500,"RAL 7044",{"$f":"IF((VLOOKUP(Wycena!$C$7,Mapping!$Q$15:$R$20,2,0))=\"tak\",\"\",AA193)","v":"RAL 7044"},{"$f":"IF(ROWS($AB$3:AB193)>(ROWS($AB$3:$AB$229)-COUNTBLANK($AB$3:$AB$229)),\"\",INDEX($AB$3:$AB$229,SMALL(IF($AB$3:$AB$229<>\"\",ROW($AB$3:$AB$229)-2),ROWS($AB$3:AB193))))","v":{"$error":"#N/A"}},null,null,null,null,null,null,null,null,null,null,null,null,null,null,null,null,null,null,null,null,263,2,2,{"$f":"IF(Wycena!$C$16=78,Mapping!AY193,AZ193)","v":2}]
[null,null,null,null,null,null,null,null,null,null,null,null,null,null,null,null,null,null,null,null,null,null,null,null,"RAL 7045",500,"RAL 7045",{"$f":"IF((VLOOKUP(Wycena!$C$7,Mapping!$Q$15:$R$20,2,0))=\"tak\",\"\",AA194)","v":"RAL 7045"},{"$f":"IF(ROWS($AB$3:AB194)>(ROWS($AB$3:$AB$229)-COUNTBLANK($AB$3:$AB$229)),\"\",INDEX($AB$3:$AB$229,SMALL(IF($AB$3:$AB$229<>\"\",ROW($AB$3:$AB$229)-2),ROWS($AB$3:AB194))))","v":{"$error":"#N/A"}},null,null,null,null,null,null,null,null,null,null,null,null,null,null,null,null,null,null,null,null,264,2,2,{"$f":"IF(Wycena!$C$16=78,Mapping!AY194,AZ194)","v":2}]
[null,null,null,null,null,null,null,null,null,null,null,null,null,null,null,null,null,null,null,null,null,null,null,null,"RAL 7046",500,"RAL 7046",{"$f":"IF((VLOOKUP(Wycena!$C$7,Mapping!$Q$15:$R$20,2,0))=\"tak\",\"\",AA195)","v":"RAL 7046"},{"$f":"IF(ROWS($AB$3:AB195)>(ROWS($AB$3:$AB$229)-COUNTBLANK($AB$3:$AB$229)),\"\",INDEX($AB$3:$AB$229,SMALL(IF($AB$3:$AB$229<>\"\",ROW($AB$3:$AB$229)-2),ROWS($AB$3:AB195))))","v":{"$error":"#N/A"}},null,null,null,null,null,null,null,null,null,null,null,null,null,null,null,null,null,null,null,null,265,2,2,{"$f":"IF(Wycena!$C$16=78,Mapping!AY195,AZ195)","v":2}]
[null,null,null,null,null,null,null,null,null,null,null,null,null,null,null,null,null,null,null,null,null,null,null,null,"RAL 7048",500,"RAL 7048",{"$f":"IF((VLOOKUP(Wycena!$C$7,Mapping!$Q$15:$R$20,2,0))=\"tak\",\"\",AA196)","v":"RAL 7048"},{"$f":"IF(ROWS($AB$3:AB196)>(ROWS($AB$3:$AB$229)-COUNTBLANK($AB$3:$AB$229)),\"\",INDEX($AB$3:$AB$229,SMALL(IF($AB$3:$AB$229<>\"\",ROW($AB$3:$AB$229)-2),ROWS($AB$3:AB196))))","v":{"$error":"#N/A"}},null,null,null,null,null,null,null,null,null,null,null,null,null,null,null,null,null,null,null,null,266,2,2,{"$f":"IF(Wycena!$C$16=78,Mapping!AY196,AZ196)","v":2}]
[null,null,null,null,null,null,null,null,null,null,null,null,null,null,null,null,null,null,null,null,null,null,null,null,"RAL 8000",500,{"$f":"Y197","v":"RAL 8000"},{"$f":"IF((VLOOKUP(Wycena!$C$7,Mapping!$Q$15:$R$20,2,0))=\"tak\",\"\",AA197)","v":"RAL 8000"},{"$f":"IF(ROWS($AB$3:AB197)>(ROWS($AB$3:$AB$229)-COUNTBLANK($AB$3:$AB$229)),\"\",INDEX($AB$3:$AB$229,SMALL(IF($AB$3:$AB$229<>\"\",ROW($AB$3:$AB$229)-2),ROWS($AB$3:AB197))))","v":{"$error":"#N/A"}},null,null,null,null,null,null,null,null,null,null,null,null,null,null,null,null,null,null,null,null,267,2,2,{"$f":"IF(Wycena!$C$16=78,Mapping!AY197,AZ197)","v":2}]
[null,null,null,null,null,null,null,null,null,null,null,null,null,null,null,null,null,null,null,null,null,null,null,null,"RAL 8001",500,"RAL 8001",{"$f":"IF((VLOOKUP(Wycena!$C$7,Mapping!$Q$15:$R$20,2,0))=\"tak\",\"\",AA198)","v":"RAL 8001"},{"$f":"IF(ROWS($AB$3:AB198)>(ROWS($AB$3:$AB$229)-COUNTBLANK($AB$3:$AB$229)),\"\",INDEX($AB$3:$AB$229,SMALL(IF($AB$3:$AB$229<>\"\",ROW($AB$3:$AB$229)-2),ROWS($AB$3:AB198))))","v":{"$error":"#N/A"}},null,null,null,null,null,null,null,null,null,null,null,null,null,null,null,null,null,null,null,null,268,2,2,{"$f":"IF(Wycena!$C$16=78,Mapping!AY198,AZ198)","v":2}]
[null,null,null,null,null,null,null,null,null,null,null,null,null,null,null,null,null,null,null,null,null,null,null,null,"RAL 8002",500,"RAL 8002",{"$f":"IF((VLOOKUP(Wycena!$C$7,Mapping!$Q$15:$R$20,2,0))=\"tak\",\"\",AA199)","v":"RAL 8002"},{"$f":"IF(ROWS($AB$3:AB199)>(ROWS($AB$3:$AB$229)-COUNTBLANK($AB$3:$AB$229)),\"\",INDEX($AB$3:$AB$229,SMALL(IF($AB$3:$AB$229<>\"\",ROW($AB$3:$AB$229)-2),ROWS($AB$3:AB199))))","v":{"$error":"#N/A"}},null,null,null,null,null,null,null,null,null,null,null,null,null,null,null,null,null,null,null,null,269,2,2,{"$f":"IF(Wycena!$C$16=78,Mapping!AY199,AZ199)","v":2}]
[null,null,null,null,null,null,null,null,null,null,null,null,null,null,null,null,null,null,null,null,null,null,null,null,"RAL 8003",500,"RAL 8003",{"$f":"IF((VLOOKUP(Wycena!$C$7,Mapping!$Q$15:$R$20,2,0))=\"tak\",\"\",AA200)","v":"RAL 8003"},{"$f":"IF(ROWS($AB$3:AB200)>(ROWS($AB$3:$AB$229)-COUNTBLANK($AB$3:$AB$229)),\"\",INDEX($AB$3:$AB$229,SMALL(IF($AB$3:$AB$229<>\"\",ROW($AB$3:$AB$229)-2),ROWS($AB$3:AB200))))","v":{"$error":"#N/A"}},null,null,null,null,null,null,null,null,null,null,null,null,null,null,null,null,null,null,null,null,270,2,2,{"$f":"IF(Wycena!$C$16=78,Mapping!AY200,AZ200)","v":2}]
[null,null,null,null,null,null,null,null,null,null,null,null,null,null,null,null,null,null,null,null,null,null,null,null,"RAL 8004",500,"RAL 8004",{"$f":"IF((VLOOKUP(Wycena!$C$7,Mapping!$Q$15:$R$20,2,0))=\"tak\",\"\",AA201)","v":"RAL 8004"},{"$f":"IF(ROWS($AB$3:AB201)>(ROWS($AB$3:$AB$229)-COUNTBLANK($AB$3:$AB$229)),\"\",INDEX($AB$3:$AB$229,SMALL(IF($AB$3:$AB$229<>\"\",ROW($AB$3:$AB$229)-2),ROWS($AB$3:AB201))))","v":{"$error":"#N/A"}},null,null,null,null,null,null,null,null,null,null,null,null,null,null,null,null,null,null,null,null,271,2,2,{"$f":"IF(Wycena!$C$16=78,Mapping!AY201,AZ201)","v":2}]
[null,null,null,null,null,null,null,null,null,null,null,null,null,null,null,null,null,null,null,null,null,null,null,null,"RAL 8007",500,"RAL 8007",{"$f":"IF((VLOOKUP(Wycena!$C$7,Mapping!$Q$15:$R$20,2,0))=\"tak\",\"\",AA202)","v":"RAL 8007"},{"$f":"IF(ROWS($AB$3:AB202)>(ROWS($AB$3:$AB$229)-COUNTBLANK($AB$3:$AB$229)),\"\",INDEX($AB$3:$AB$229,SMALL(IF($AB$3:$AB$229<>\"\",ROW($AB$3:$AB$229)-2),ROWS($AB$3:AB202))))","v":{"$error":"#N/A"}},null,null,null,null,null,null,null,null,null,null,null,null,null,null,null,null,null,null,null,null,272,2,2,{"$f":"IF(Wycena!$C$16=78,Mapping!AY202,AZ202)","v":2}]
[null,null,null,null,null,null,null,null,null,null,null,null,null,null,null,null,null,null,null,null,null,null,null,null,"RAL 8008",500,"RAL 8008",{"$f":"IF((VLOOKUP(Wycena!$C$7,Mapping!$Q$15:$R$20,2,0))=\"tak\",\"\",AA203)","v":"RAL 8008"},{"$f":"IF(ROWS($AB$3:AB203)>(ROWS($AB$3:$AB$229)-COUNTBLANK($AB$3:$AB$229)),\"\",INDEX($AB$3:$AB$229,SMALL(IF($AB$3:$AB$229<>\"\",ROW($AB$3:$AB$229)-2),ROWS($AB$3:AB203))))","v":{"$error":"#N/A"}},null,null,null,null,null,null,null,null,null,null,null,null,null,null,null,null,null,null,null,null,273,2,2,{"$f":"IF(Wycena!$C$16=78,Mapping!AY203,AZ203)","v":2}]
[null,null,null,null,null,null,null,null,null,null,null,null,null,null,null,null,null,null,null,null,null,null,null,null,"RAL 8011",500,"RAL 8011",{"$f":"IF((VLOOKUP(Wycena!$C$7,Mapping!$Q$15:$R$20,2,0))=\"tak\",\"\",AA204)","v":"RAL 8011"},{"$f":"IF(ROWS($AB$3:AB204)>(ROWS($AB$3:$AB$229)-COUNTBLANK($AB$3:$AB$229)),\"\",INDEX($AB$3:$AB$229,SMALL(IF($AB$3:$AB$229<>\"\",ROW($AB$3:$AB$229)-2),ROWS($AB$3:AB204))))","v":{"$error":"#N/A"}},null,null,null,null,null,null,null,null,null,null,null,null,null,null,null,null,null,null,null,null,274,2,2,{"$f":"IF(Wycena!$C$16=78,Mapping!AY204,AZ204)","v":2}]
[null,null,null,null,null,null,null,null,null,null,null,null,null,null,null,null,null,null,null,null,null,null,null,null,"RAL 8012",500,"RAL 8012",{"$f":"IF((VLOOKUP(Wycena!$C$7,Mapping!$Q$15:$R$20,2,0))=\"tak\",\"\",AA205)","v":"RAL 8012"},{"$f":"IF(ROWS($AB$3:AB205)>(ROWS($AB$3:$AB$229)-COUNTBLANK($AB$3:$AB$229)),\"\",INDEX($AB$3:$AB$229,SMALL(IF($AB$3:$AB$229<>\"\",ROW($AB$3:$AB$229)-2),ROWS($AB$3:AB205))))","v":{"$error":"#N/A"}},null,null,null,null,null,null,null,null,null,null,null,null,null,null,null,null,null,null,null,null,275,2,2,{"$f":"IF(Wycena!$C$16=78,Mapping!AY205,AZ205)","v":2}]
[null,null,null,null,null,null,null,null,null,null,null,null,null,null,null,null,null,null,null,null,null,null,null,null,"RAL 8014",500,"RAL 8014",{"$f":"IF((VLOOKUP(Wycena!$C$7,Mapping!$Q$15:$R$20,2,0))=\"tak\",\"\",AA206)","v":"RAL 8014"},{"$f":"IF(ROWS($AB$3:AB206)>(ROWS($AB$3:$AB$229)-COUNTBLANK($AB$3:$AB$229)),\"\",INDEX($AB$3:$AB$229,SMALL(IF($AB$3:$AB$229<>\"\",ROW($AB$3:$AB$229)-2),ROWS($AB$3:AB206))))","v":{"$error":"#N/A"}},null,null,null,null,null,null,null,null,null,null,null,null,null,null,null,null,null,null,null,null,276,2,2,{"$f":"IF(Wycena!$C$16=78,Mapping!AY206,AZ206)","v":2}]
[null,null,null,null,null,null,null,null,null,null,null,null,null,null,null,null,null,null,null,null,null,null,null,null,"RAL 8015",500,"RAL 8015",{"$f":"IF((VLOOKUP(Wycena!$C$7,Mapping!$Q$15:$R$20,2,0))=\"tak\",\"\",AA207)","v":"RAL 8015"},{"$f":"IF(ROWS($AB$3:AB207)>(ROWS($AB$3:$AB$229)-COUNTBLANK($AB$3:$AB$229)),\"\",INDEX($AB$3:$AB$229,SMALL(IF($AB$3:$AB$229<>\"\",ROW($AB$3:$AB$229)-2),ROWS($AB$3:AB207))))","v":{"$error":"#N/A"}},null,null,null,null,null,null,null,null,null,null,null,null,null,null,null,null,null,null,null,null,277,2,2,{"$f":"IF(Wycena!$C$16=78,Mapping!AY207,AZ207)","v":2}]
[null,null,null,null,null,null,null,null,null,null,null,null,null,null,null,null,null,null,null,null,null,null,null,null,"RAL 8016",500,"RAL 8016",{"$f":"IF((VLOOKUP(Wycena!$C$7,Mapping!$Q$15:$R$20,2,0))=\"tak\",\"\",AA208)","v":"RAL 8016"},{"$f":"IF(ROWS($AB$3:AB208)>(ROWS($AB$3:$AB$229)-COUNTBLANK($AB$3:$AB$229)),\"\",INDEX($AB$3:$AB$229,SMALL(IF($AB$3:$AB$229<>\"\",ROW($AB$3:$AB$229)-2),ROWS($AB$3:AB208))))","v":{"$error":"#N/A"}},null,null,null,null,null,null,null,null,null,null,null,null,null,null,null,null,null,null,null,null,278,2,2,{"$f":"IF(Wycena!$C$16=78,Mapping!AY208,AZ208)","v":2}]
[null,null,null,null,null,null,null,null,null,null,null,null,null,null,null,null,null,null,null,null,null,null,null,null,"RAL 8017",500,"RAL 8017",{"$f":"IF((VLOOKUP(Wycena!$C$7,Mapping!$Q$15:$R$20,2,0))=\"tak\",\"\",AA209)","v":"RAL 8017"},{"$f":"IF(ROWS($AB$3:AB209)>(ROWS($AB$3:$AB$229)-COUNTBLANK($AB$3:$AB$229)),\"\",INDEX($AB$3:$AB$229,SMALL(IF($AB$3:$AB$229<>\"\",ROW($AB$3:$AB$229)-2),ROWS($AB$3:AB209))))","v":{"$error":"#N/A"}},null,null,null,null,null,null,null,null,null,null,null,null,null,null,null,null,null,null,null,null,279,2,2,{"$f":"IF(Wycena!$C$16=78,Mapping!AY209,AZ209)","v":2}]
[null,null,null,null,null,null,null,null,null,null,null,null,null,null,null,null,null,null,null,null,null,null,null,null,"RAL 8019",500,"RAL 8019",{"$f":"IF((VLOOKUP(Wycena!$C$7,Mapping!$Q$15:$R$20,2,0))=\"tak\",\"\",AA210)","v":"RAL 8019"},{"$f":"IF(ROWS($AB$3:AB210)>(ROWS($AB$3:$AB$229)-COUNTBLANK($AB$3:$AB$229)),\"\",INDEX($AB$3:$AB$229,SMALL(IF($AB$3:$AB$229<>\"\",ROW($AB$3:$AB$229)-2),ROWS($AB$3:AB210))))","v":{"$error":"#N/A"}},null,null,null,null,null,null,null,null,null,null,null,null,null,null,null,null,null,null,null,null,280,2,2,{"$f":"IF(Wycena!$C$16=78,Mapping!AY210,AZ210)","v":2}]
[null,null,null,null,null,null,null,null,null,null,null,null,null,null,null,null,null,null,null,null,null,null,null,null,"RAL 8022",500,"RAL 8022",{"$f":"IF((VLOOKUP(Wycena!$C$7,Mapping!$Q$15:$R$20,2,0))=\"tak\",\"\",AA211)","v":"RAL 8022"},{"$f":"IF(ROWS($AB$3:AB211)>(ROWS($AB$3:$AB$229)-COUNTBLANK($AB$3:$AB$229)),\"\",INDEX($AB$3:$AB$229,SMALL(IF($AB$3:$AB$229<>\"\",ROW($AB$3:$AB$229)-2),ROWS($AB$3:AB211))))","v":{"$error":"#N/A"}},null,null,null,null,null,null,null,null,null,null,null,null,null,null,null,null,null,null,null,null,281,2,2,{"$f":"IF(Wycena!$C$16=78,Mapping!AY211,AZ211)","v":2}]
[null,null,null,null,null,null,null,null,null,null,null,null,null,null,null,null,null,null,null,null,null,null,null,null,"RAL 8023",500,"RAL 8023",{"$f":"IF((VLOOKUP(Wycena!$C$7,Mapping!$Q$15:$R$20,2,0))=\"tak\",\"\",AA212)","v":"RAL 8023"},{"$f":"IF(ROWS($AB$3:AB212)>(ROWS($AB$3:$AB$229)-COUNTBLANK($AB$3:$AB$229)),\"\",INDEX($AB$3:$AB$229,SMALL(IF($AB$3:$AB$229<>\"\",ROW($AB$3:$AB$229)-2),ROWS($AB$3:AB212))))","v":{"$error":"#N/A"}},null,null,null,null,null,null,null,null,null,null,null,null,null,null,null,null,null,null,null,null,282,2,2,{"$f":"IF(Wycena!$C$16=78,Mapping!AY212,AZ212)","v":2}]
[null,null,null,null,null,null,null,null,null,null,null,null,null,null,null,null,null,null,null,null,null,null,null,null,"RAL 8024",500,"RAL 8024",{"$f":"IF((VLOOKUP(Wycena!$C$7,Mapping!$Q$15:$R$20,2,0))=\"tak\",\"\",AA213)","v":"RAL 8024"},{"$f":"IF(ROWS($AB$3:AB213)>(ROWS($AB$3:$AB$229)-COUNTBLANK($AB$3:$AB$229)),\"\",INDEX($AB$3:$AB$229,SMALL(IF($AB$3:$AB$229<>\"\",ROW($AB$3:$AB$229)-2),ROWS($AB$3:AB213))))","v":{"$error":"#N/A"}},null,null,null,null,null,null,null,null,null,null,null,null,null,null,null,null,null,null,null,null,283,2,2,{"$f":"IF(Wycena!$C$16=78,Mapping!AY213,AZ213)","v":2}]
[null,null,null,null,null,null,null,null,null,null,null,null,null,null,null,null,null,null,null,null,null,null,null,null,"RAL 8025",500,"RAL 8025",{"$f":"IF((VLOOKUP(Wycena!$C$7,Mapping!$Q$15:$R$20,2,0))=\"tak\",\"\",AA214)","v":"RAL 8025"},{"$f":"IF(ROWS($AB$3:AB214)>(ROWS($AB$3:$AB$229)-COUNTBLANK($AB$3:$AB$229)),\"\",INDEX($AB$3:$AB$229,SMALL(IF($AB$3:$AB$229<>\"\",ROW($AB$3:$AB$229)-2),ROWS($AB$3:AB214))))","v":{"$error":"#N/A"}},null,null,null,null,null,null,null,null,null,null,null,null,null,null,null,null,null,null,null,null,284,2,2,{"$f":"IF(Wycena!$C$16=78,Mapping!AY214,AZ214)","v":2}]
[null,null,null,null,null,null,null,null,null,null,null,null,null,null,null,null,null,null,null,null,null,null,null,null,"RAL 8028",500,"RAL 8028",{"$f":"IF((VLOOKUP(Wycena!$C$7,Mapping!$Q$15:$R$20,2,0))=\"tak\",\"\",AA215)","v":"RAL 8028"},{"$f":"IF(ROWS($AB$3:AB215)>(ROWS($AB$3:$AB$229)-COUNTBLANK($AB$3:$AB$229)),\"\",INDEX($AB$3:$AB$229,SMALL(IF($AB$3:$AB$229<>\"\",ROW($AB$3:$AB$229)-2),ROWS($AB$3:AB215))))","v":{"$error":"#N/A"}},null,null,null,null,null,null,null,null,null,null,null,null,null,null,null,null,null,null,null,null,285,2,2,{"$f":"IF(Wycena!$C$16=78,Mapping!AY215,AZ215)","v":2}]
[null,null,null,null,null,null,null,null,null,null,null,null,null,null,null,null,null,null,null,null,null,null,null,null,"RAL 8029",500,"RAL 8029",{"$f":"IF((VLOOKUP(Wycena!$C$7,Mapping!$Q$15:$R$20,2,0))=\"tak\",\"\",AA216)","v":"RAL 8029"},{"$f":"IF(ROWS($AB$3:AB216)>(ROWS($AB$3:$AB$229)-COUNTBLANK($AB$3:$AB$229)),\"\",INDEX($AB$3:$AB$229,SMALL(IF($AB$3:$AB$229<>\"\",ROW($AB$3:$AB$229)-2),ROWS($AB$3:AB216))))","v":{"$error":"#N/A"}},null,null,null,null,null,null,null,null,null,null,null,null,null,null,null,null,null,null,null,null,286,2,2,{"$f":"IF(Wycena!$C$16=78,Mapping!AY216,AZ216)","v":2}]
[null,null,null,null,null,null,null,null,null,null,null,null,null,null,null,null,null,null,null,null,null,null,null,null,"RAL 9001",500,"RAL 9001",{"$f":"IF((VLOOKUP(Wycena!$C$7,Mapping!$Q$15:$R$20,2,0))=\"tak\",\"\",AA217)","v":"RAL 9001"},{"$f":"IF(ROWS($AB$3:AB217)>(ROWS($AB$3:$AB$229)-COUNTBLANK($AB$3:$AB$229)),\"\",INDEX($AB$3:$AB$229,SMALL(IF($AB$3:$AB$229<>\"\",ROW($AB$3:$AB$229)-2),ROWS($AB$3:AB217))))","v":{"$error":"#N/A"}},null,null,null,null,null,null,null,null,null,null,null,null,null,null,null,null,null,null,null,null,287,2,2,{"$f":"IF(Wycena!$C$16=78,Mapping!AY217,AZ217)","v":2}]
[null,null,null,null,null,null,null,null,null,null,null,null,null,null,null,null,null,null,null,null,null,null,null,null,"RAL 9002",500,"RAL 9002",{"$f":"IF((VLOOKUP(Wycena!$C$7,Mapping!$Q$15:$R$20,2,0))=\"tak\",\"\",AA218)","v":"RAL 9002"},{"$f":"IF(ROWS($AB$3:AB218)>(ROWS($AB$3:$AB$229)-COUNTBLANK($AB$3:$AB$229)),\"\",INDEX($AB$3:$AB$229,SMALL(IF($AB$3:$AB$229<>\"\",ROW($AB$3:$AB$229)-2),ROWS($AB$3:AB218))))","v":{"$error":"#N/A"}},null,null,null,null,null,null,null,null,null,null,null,null,null,null,null,null,null,null,null,null,288,2,2,{"$f":"IF(Wycena!$C$16=78,Mapping!AY218,AZ218)","v":2}]
[null,null,null,null,null,null,null,null,null,null,null,null,null,null,null,null,null,null,null,null,null,null,null,null,"RAL 9003",500,"RAL 9003",{"$f":"IF((VLOOKUP(Wycena!$C$7,Mapping!$Q$15:$R$20,2,0))=\"tak\",\"\",AA219)","v":"RAL 9003"},{"$f":"IF(ROWS($AB$3:AB219)>(ROWS($AB$3:$AB$229)-COUNTBLANK($AB$3:$AB$229)),\"\",INDEX($AB$3:$AB$229,SMALL(IF($AB$3:$AB$229<>\"\",ROW($AB$3:$AB$229)-2),ROWS($AB$3:AB219))))","v":{"$error":"#N/A"}},null,null,null,null,null,null,null,null,null,null,null,null,null,null,null,null,null,null,null,null,289,2,2,{"$f":"IF(Wycena!$C$16=78,Mapping!AY219,AZ219)","v":2}]
[null,null,null,null,null,null,null,null,null,null,null,null,null,null,null,null,null,null,null,null,null,null,null,null,"RAL 9004",500,"RAL 9004",{"$f":"IF((VLOOKUP(Wycena!$C$7,Mapping!$Q$15:$R$20,2,0))=\"tak\",\"\",AA220)","v":"RAL 9004"},{"$f":"IF(ROWS($AB$3:AB220)>(ROWS($AB$3:$AB$229)-COUNTBLANK($AB$3:$AB$229)),\"\",INDEX($AB$3:$AB$229,SMALL(IF($AB$3:$AB$229<>\"\",ROW($AB$3:$AB$229)-2),ROWS($AB$3:AB220))))","v":{"$error":"#N/A"}},null,null,null,null,null,null,null,null,null,null,null,null,null,null,null,null,null,null,null,null,290,2,2,{"$f":"IF(Wycena!$C$16=78,Mapping!AY220,AZ220)","v":2}]
[null,null,null,null,null,null,null,null,null,null,null,null,null,null,null,null,null,null,null,null,null,null,null,null,"RAL 9005",500,"RAL 9005",{"$f":"IF((VLOOKUP(Wycena!$C$7,Mapping!$Q$15:$R$20,2,0))=\"tak\",\"\",AA221)","v":"RAL 9005"},{"$f":"IF(ROWS($AB$3:AB221)>(ROWS($AB$3:$AB$229)-COUNTBLANK($AB$3:$AB$229)),\"\",INDEX($AB$3:$AB$229,SMALL(IF($AB$3:$AB$229<>\"\",ROW($AB$3:$AB$229)-2),ROWS($AB$3:AB221))))","v":{"$error":"#N/A"}},null,null,null,null,null,null,null,null,null,null,null,null,null,null,null,null,null,null,null,null,291,2,2,{"$f":"IF(Wycena!$C$16=78,Mapping!AY221,AZ221)","v":2}]
[null,null,null,null,null,null,null,null,null,null,null,null,null,null,null,null,null,null,null,null,null,null,null,null,"RAL 9006",500,"RAL 9006",{"$f":"IF((VLOOKUP(Wycena!$C$7,Mapping!$Q$15:$R$20,2,0))=\"tak\",\"\",AA222)","v":"RAL 9006"},{"$f":"IF(ROWS($AB$3:AB222)>(ROWS($AB$3:$AB$229)-COUNTBLANK($AB$3:$AB$229)),\"\",INDEX($AB$3:$AB$229,SMALL(IF($AB$3:$AB$229<>\"\",ROW($AB$3:$AB$229)-2),ROWS($AB$3:AB222))))","v":{"$error":"#N/A"}},null,null,null,null,null,null,null,null,null,null,null,null,null,null,null,null,null,null,null,null,292,2,2,{"$f":"IF(Wycena!$C$16=78,Mapping!AY222,AZ222)","v":2}]
[null,null,null,null,null,null,null,null,null,null,null,null,null,null,null,null,null,null,null,null,null,null,null,null,"RAL 9007",500,"RAL 9007",{"$f":"IF((VLOOKUP(Wycena!$C$7,Mapping!$Q$15:$R$20,2,0))=\"tak\",\"\",AA223)","v":"RAL 9007"},{"$f":"IF(ROWS($AB$3:AB223)>(ROWS($AB$3:$AB$229)-COUNTBLANK($AB$3:$AB$229)),\"\",INDEX($AB$3:$AB$229,SMALL(IF($AB$3:$AB$229<>\"\",ROW($AB$3:$AB$229)-2),ROWS($AB$3:AB223))))","v":{"$error":"#N/A"}},null,null,null,null,null,null,null,null,null,null,null,null,null,null,null,null,null,null,null,null,293,2,2,{"$f":"IF(Wycena!$C$16=78,Mapping!AY223,AZ223)","v":2}]
[null,null,null,null,null,null,null,null,null,null,null,null,null,null,null,null,null,null,null,null,null,null,null,null,"RAL 9010",500,"RAL 9010",{"$f":"IF((VLOOKUP(Wycena!$C$7,Mapping!$Q$15:$R$20,2,0))=\"tak\",\"\",AA224)","v":"RAL 9010"},{"$f":"IF(ROWS($AB$3:AB224)>(ROWS($AB$3:$AB$229)-COUNTBLANK($AB$3:$AB$229)),\"\",INDEX($AB$3:$AB$229,SMALL(IF($AB$3:$AB$229<>\"\",ROW($AB$3:$AB$229)-2),ROWS($AB$3:AB224))))","v":{"$error":"#N/A"}},null,null,null,null,null,null,null,null,null,null,null,null,null,null,null,null,null,null,null,null,294,2,2,{"$f":"IF(Wycena!$C$16=78,Mapping!AY224,AZ224)","v":2}]
[null,null,null,null,null,null,null,null,null,null,null,null,null,null,null,null,null,null,null,null,null,null,null,null,"RAL 9011",500,"RAL 9011",{"$f":"IF((VLOOKUP(Wycena!$C$7,Mapping!$Q$15:$R$20,2,0))=\"tak\",\"\",AA225)","v":"RAL 9011"},{"$f":"IF(ROWS($AB$3:AB225)>(ROWS($AB$3:$AB$229)-COUNTBLANK($AB$3:$AB$229)),\"\",INDEX($AB$3:$AB$229,SMALL(IF($AB$3:$AB$229<>\"\",ROW($AB$3:$AB$229)-2),ROWS($AB$3:AB225))))","v":{"$error":"#N/A"}},null,null,null,null,null,null,null,null,null,null,null,null,null,null,null,null,null,null,null,null,295,2,2,{"$f":"IF(Wycena!$C$16=78,Mapping!AY225,AZ225)","v":2}]
[null,null,null,null,null,null,null,null,null,null,null,null,null,null,null,null,null,null,null,null,null,null,null,null,"RAL 9017",500,"RAL 9017",{"$f":"IF((VLOOKUP(Wycena!$C$7,Mapping!$Q$15:$R$20,2,0))=\"tak\",\"\",AA226)","v":"RAL 9017"},{"$f":"IF(ROWS($AB$3:AB226)>(ROWS($AB$3:$AB$229)-COUNTBLANK($AB$3:$AB$229)),\"\",INDEX($AB$3:$AB$229,SMALL(IF($AB$3:$AB$229<>\"\",ROW($AB$3:$AB$229)-2),ROWS($AB$3:AB226))))","v":{"$error":"#N/A"}},null,null,null,null,null,null,null,null,null,null,null,null,null,null,null,null,null,null,null,null,296,2,2,{"$f":"IF(Wycena!$C$16=78,Mapping!AY226,AZ226)","v":2}]
[null,null,null,null,null,null,null,null,null,null,null,null,null,null,null,null,null,null,null,null,null,null,null,null,"RAL 9018",500,"RAL 9018",{"$f":"IF((VLOOKUP(Wycena!$C$7,Mapping!$Q$15:$R$20,2,0))=\"tak\",\"\",AA227)","v":"RAL 9018"},{"$f":"IF(ROWS($AB$3:AB227)>(ROWS($AB$3:$AB$229)-COUNTBLANK($AB$3:$AB$229)),\"\",INDEX($AB$3:$AB$229,SMALL(IF($AB$3:$AB$229<>\"\",ROW($AB$3:$AB$229)-2),ROWS($AB$3:AB227))))","v":{"$error":"#N/A"}},null,null,null,null,null,null,null,null,null,null,null,null,null,null,null,null,null,null,null,null,297,2,2,{"$f":"IF(Wycena!$C$16=78,Mapping!AY227,AZ227)","v":2}]
[null,null,null,null,null,null,null,null,null,null,null,null,null,null,null,null,null,null,null,null,null,null,null,null,"RAL 9022",500,"RAL 9022",{"$f":"IF((VLOOKUP(Wycena!$C$7,Mapping!$Q$15:$R$20,2,0))=\"tak\",\"\",AA228)","v":"RAL 9022"},{"$f":"IF(ROWS($AB$3:AB228)>(ROWS($AB$3:$AB$229)-COUNTBLANK($AB$3:$AB$229)),\"\",INDEX($AB$3:$AB$229,SMALL(IF($AB$3:$AB$229<>\"\",ROW($AB$3:$AB$229)-2),ROWS($AB$3:AB228))))","v":{"$error":"#N/A"}},null,null,null,null,null,null,null,null,null,null,null,null,null,null,null,null,null,null,null,null,298,2,2,{"$f":"IF(Wycena!$C$16=78,Mapping!AY228,AZ228)","v":2}]
[null,null,null,null,null,null,null,null,null,null,null,null,null,null,null,null,null,null,null,null,null,null,null,null,"RAL 9023",500,"RAL 9023",{"$f":"IF((VLOOKUP(Wycena!$C$7,Mapping!$Q$15:$R$20,2,0))=\"tak\",\"\",AA229)","v":"RAL 9023"},{"$f":"IF(ROWS($AB$3:AB229)>(ROWS($AB$3:$AB$229)-COUNTBLANK($AB$3:$AB$229)),\"\",INDEX($AB$3:$AB$229,SMALL(IF($AB$3:$AB$229<>\"\",ROW($AB$3:$AB$229)-2),ROWS($AB$3:AB229))))","v":{"$error":"#N/A"}},null,null,null,null,null,null,null,null,null,null,null,null,null,null,null,null,null,null,null,null,299,2,2,{"$f":"IF(Wycena!$C$16=78,Mapping!AY229,AZ229)","v":2}]
[null,null,null,null,null,null,null,null,null,null,null,null,null,null,null,null,null,null,null,null,null,null,null,null,null,null,null,null,null,null,null,null,null,null,null,null,null,null,null,null,null,null,null,null,null,null,null,null,null,300,2,2,{"$f":"IF(Wycena!$C$16=78,Mapping!AY230,AZ230)","v":2}]
[null,null,null,null,null,null,null,null,null,null,null,null,null,null,null,null,null,null,null,null,null,null,null,null,null,null,null,null,"x"]
[null,null,null,null,null,null,null,null,null,null,null,null,null,null,null,null,null,null,null,null,null,null,null,null,null,null,null,null,{"$f":"$AC$3:INDEX($AC$3:$AC$229,(ROWS($AB$3:$AB$229)-COUNTBLANK($AB$3:$AB$229)))","v":{"$error":"#N/A"}}]